{"text_format":"1","workbook":"xlsx","n_sheets":4,"sheets":["NonQM Program(LS)","Feed(WS)","Cover Page","Sheet1"],"not_rendered":{"charts":0,"images":5,"macros":1,"external_links":0,"defined_names":1121,"comments":0,"pivot_tables":0},"unopened":[],"bounds":{"document_bytes":16777216,"sheet_cells":100000,"rows_first":2000,"rows_last":500,"rows_between":2000,"halvings":0,"cell_chars":16384,"cell_head_chars":4096},"cells_cut":0,"cells_raw":0,"read":"whole","date_system":"1900"}

{"sheet":"NonQM Program(LS)","index":0,"n_rows":230,"n_cols":27,"rows_kept":230,"cut":false,"hidden":false,"merged":[[73,0,73,4],[74,0,86,4],[72,6,72,7],[73,6,73,7],[74,6,74,7],[70,6,70,7],[71,6,71,7],[64,6,64,7],[65,6,65,7],[66,6,66,7],[75,6,75,7],[34,6,34,7],[35,6,35,7],[36,6,36,7],[37,6,37,7],[38,6,38,7],[39,6,39,7],[40,6,40,7],[41,6,41,7],[42,6,42,7],[43,6,43,7],[44,6,44,7],[45,6,45,7],[46,6,46,7],[47,6,47,7],[48,6,48,7],[49,6,49,7],[8,18,8,19],[12,6,12,7],[13,6,13,7],[35,18,35,20],[31,6,31,7],[33,10,33,12],[32,6,32,7],[34,18,34,20],[20,18,20,19],[17,18,17,19],[18,18,18,19],[30,10,30,11],[34,10,34,11],[29,6,29,7],[28,6,28,7],[30,6,30,7],[24,10,24,12],[50,6,50,7],[51,6,51,7],[52,6,52,7],[62,6,62,7],[63,6,63,7],[37,18,37,20],[36,18,36,20],[46,14,46,15],[47,14,47,15],[48,14,48,15],[50,14,50,15],[53,6,53,7],[54,6,54,7],[55,6,55,7],[56,6,56,7],[57,6,57,7],[58,6,58,7],[59,6,59,7],[60,6,60,7],[61,6,61,7],[36,10,36,11],[62,14,62,16],[63,14,69,16],[39,10,39,12],[0,7,1,10],[0,14,1,16],[3,7,3,10],[4,14,4,16],[8,6,8,16],[9,6,9,7],[10,6,10,7],[11,6,11,7],[27,10,27,11],[2,7,2,10],[2,14,2,16],[3,13,3,16],[4,12,4,13],[17,6,17,7],[18,6,18,7],[27,14,27,15],[14,6,14,7],[25,6,25,7],[24,6,24,8],[27,6,27,7],[25,10,25,11],[26,10,26,11],[26,6,26,7],[25,14,25,15],[55,0,55,4],[56,0,70,4],[69,6,69,8],[57,14,57,15],[58,14,58,15],[16,6,16,7],[35,10,35,11],[40,10,40,11],[41,10,41,11],[44,10,44,11],[64,10,64,12],[70,11,70,12],[68,12,69,12],[51,14,51,15],[59,14,59,15],[26,14,26,15],[34,14,34,15],[28,10,28,11],[28,14,28,15],[29,14,29,15],[30,14,30,15],[19,6,19,7],[49,14,49,15],[37,10,37,11],[31,10,31,11],[33,6,33,7],[16,26,16,28],[20,26,20,28],[5,22,6,25],[8,0,8,4],[29,26,29,28],[24,14,24,16],[20,6,20,7],[16,18,16,19],[23,18,23,19],[7,18,7,19],[5,18,6,21],[5,0,6,16],[15,6,15,7],[28,18,28,19],[14,26,14,28],[19,18,19,19],[22,18,22,19],[29,10,29,11],[7,26,7,28],[8,26,8,28],[9,26,9,28],[10,26,10,28],[7,21,7,24],[8,23,8,25],[11,26,11,28],[13,26,13,27],[12,26,12,28],[9,23,9,25],[10,23,10,25],[12,18,12,19],[11,18,11,19],[15,18,15,19],[15,26,15,28],[9,18,9,19],[13,18,13,19],[14,18,14,19],[15,22,15,25],[14,22,14,25],[13,22,13,25],[12,22,12,25],[10,18,10,19],[72,14,77,16],[19,22,19,25],[31,26,45,28],[40,22,40,25],[24,18,24,19],[25,18,25,19],[26,18,26,19],[27,18,27,19],[31,18,31,19],[38,14,38,15],[44,14,44,15],[33,18,33,19],[40,14,40,15],[32,18,32,19],[42,14,42,15],[27,22,27,25],[39,18,44,21],[21,18,21,19],[31,14,31,15],[32,14,32,15],[33,14,33,15],[52,14,52,15],[54,14,54,16],[21,26,21,28],[29,18,29,19],[17,26,17,28],[22,26,22,28],[55,14,55,15],[56,14,56,16],[60,14,60,15],[43,14,43,15],[37,14,37,16],[30,18,30,19],[45,14,45,15],[38,18,38,20],[34,22,35,25],[39,14,39,15],[41,14,41,15],[45,10,45,11],[47,10,47,12],[52,10,52,11],[35,14,35,15],[73,10,86,12],[71,10,71,11],[49,10,49,11],[53,10,53,12],[42,10,42,11],[48,10,48,11],[54,10,54,11],[55,10,55,11],[56,10,56,11],[59,10,59,12],[63,10,63,12],[60,10,60,11],[43,10,43,11],[50,10,50,11],[57,10,57,11],[61,10,61,11],[51,10,51,11],[80,14,85,16],[79,14,79,16],[71,14,71,16]]}
[null,null,null,null,null,null,null,"LoanStream Mortgage",null,null,null,null,null,null,"Wholesale Ratesheet"]
[]
[null,null,null,null,null,null,null,"19000 MacArthur Blvd, Suite 200",null,null,null,null,null,null,"30 Day Lock Period"]
[null,null,null,null,null,null,null,"Irvine, CA 92612",null,null,null,null,null,"Borrower Paid Compensation*"]
[null,null,null,null,null,null,null,null,null,null,null,null,"Effective Date:",null,"2025-07-18"]
["NonQM Program Pricing",null,null,null,null,null,null,null,null,null,null,null,null,null,null,null,null,null,"NonQM Price Calculator",null,null,null,"Calculator does not verify eligibility.\nPlease use in conjunction with product matrix."]
[]
[null,null,null,null,null,null,null,null,null,null,null,null,null,null,null,null,null,null,null,null,"Inputs","Wholesale Ratesheet",null,null,null,{"$f":"O5","v":"2025-07-18"},"Full Doc Column Includes"]
["Base Rate / Base Price",null,null,null,null,null,"FICO/LTV Price Adjustments",null,null,null,null,null,null,null,null,null,null,null," Interest Rate →",null,"Choose a Selection",null,null,null,null,null,"Tax Returns"]
["Rate","Full Doc","Alt Doc","DSCR","DSCR 5-8 Units",null,null,null,"<=50","50.01-60","60.01-65","65.01-70","70.01-75","75.01-80","80.01-85","85.01-90","90.01-95",null,"LTV Range",null,"Choose a Selection",null,null,null,null,null,"1099 Only"]
[6.25,{"$error":"#N/A"},{"$error":"#N/A"},{"$error":"#N/A"},{"$error":"#N/A"},null,"780+",0,0.625,0.5,0.5,0.375,0.125,-0.125,-1.5,-2.75,{"$error":"#N/A"},null,"FICO Range",null,"Choose a Selection",{"$f":"IF(OR(U10='Feed(WS)'!B4:B5),INDEX(J11:J21,MATCH(U11,G11:G21,0)),(INDEX(I11:Q21,MATCH(U11,G11:G21,0),MATCH(U10,I10:Q10))))","v":{"$error":"#N/A"}},null,null,null,null,"Asset Utilization Only"]
[6.375,{"$error":"#N/A"},{"$error":"#N/A"},{"$error":"#N/A"},{"$error":"#N/A"},null,"760-779",0,0.5,0.5,0.375,0.25,0,-0.375,-1.75,-3,{"$error":"#N/A"},null,"Program",null,"Core",{"$f":"IF(U12=\"Choose a Selection\",0,(INDEX(M26:M32,MATCH(U12,K26:K32,0))))","v":0},null,null,null,null,"Asset Utilization W/ Full Doc"]
[6.4989999999999997,98.75,98.75,{"$error":"#N/A"},{"$error":"#N/A"},null,"740-759",0,0.5,0.375,0.25,0,-0.375,-0.5,-2,-3.25,{"$error":"#N/A"},null,"Reserves",null,"Choose a Selection",{"$f":"IF(U13=\"Choose a Selection\",0,(INDEX(M35:M38,MATCH(U13,K35:K38,0))))","v":0},{"$f":"'Feed(WS)'!B63","v":""},null,null,null,"VOE"]
[6.625,99.25,99.25,99,{"$error":"#N/A"},null,"720-739",0,0.375,0.25,0,-0.375,-0.5,-1,-2.5,-3.75,{"$error":"#N/A"},null,"Payment History",null,"Choose a Selection",{"$f":"IF(U14=\"Choose a Selection\",0,(INDEX(M41:M46,MATCH(U14,K41:K46,0))))","v":0},{"$f":"'Feed(WS)'!B64","v":""}]
[6.75,99.5,99.5,99.5,{"$error":"#N/A"},null,"700-719",0,0.25,0,-0.375,-0.5,-1,-1.5,-3.25,-4.5,{"$error":"#N/A"},null,"Credit Events",null,"36 Months",{"$f":"IF(U15=\"Choose a Selection\",0,(INDEX(M49:M53,MATCH(U15,K49:K53,0))))","v":-0.25},{"$f":"'Feed(WS)'!B66","v":""},null,null,null,"Alt Doc Column Includes"]
[6.875,99.75,99.75,99.75,{"$error":"#N/A"},null,"680-699",0,0,-0.375,-0.5,-1,-1.5,-2.5,-4.25,{"$error":"#N/A"},{"$error":"#N/A"},null,"Doc Type",null,"Choose a Selection",null,{"$f":"'Feed(WS)'!B67","v":0},null,null,null,"12 Bank Statements"]
[6.9989999999999997,100.25,100.25,100.25,{"$error":"#N/A"},null,"660-679",0,-0.5,-0.5,-1,-1.5,-2.25,-3.25,{"$error":"#N/A"},{"$error":"#N/A"},{"$error":"#N/A"},null,"Additional Adjs",null,"Choose a Selection",{"$f":"IF(AND(OR(U10='Feed(WS)'!B10:B11),OR(U17='Feed(WS)'!E4,U17='Feed(WS)'!E6)),NA(),IF((AND((IF(U10=\"85.01-90\",1,0))=1,(IF(U16=\"DSCR\",1,0))=1))=TRUE,NA(),(IF(OR((AND(OR(U11='Feed(WS)'!$A$7:$A$12),IF(U10=\"80.01-85\",1,0),IF(U16=\"DSCR\",1,0)))=TRUE,(AND(OR(U11='Feed(WS)'!A6:A12),IF(U10=\"80.01-85\",1,0),IF(U16=\"DSCR\",1,0),OR(U21='Feed(WS)'!J5:J9))=TRUE)),NA(),IF(U17=\"Choose a Selection\",0,(IF(U17=\"None in this Dropdown\",0,IF(U17=\"12 Month Full / Alt Doc\",0,INDEX(I$27:I$67,MATCH(U17,G$27:G$67,0))))))))))","v":0},"Select \"Inv. & 2nd Home >75% LTV\" Adjustment",null,null,null,"12 or 24 CPA P&L"]
[7.125,100.5,100.5,100.5,{"$error":"#N/A"},null,"640-659",0,-1,-1.25,-1.75,-2.25,-3.25,-4.25,{"$error":"#N/A"},{"$error":"#N/A"},{"$error":"#N/A"},null,"Citizenships",null,"Choose a Selection",{"$f":"(IF(U18=\"US Citizen\",0,(IF(U18=\"Permanent Resident\",0,(IF(U18=\"Non Perm Resident\",0,(IF(U18=\"ITIN\",VLOOKUP(U18,G27:I67,3,0),(IF(U18=\"Foreign Nat' No Fico\",INDEX(I13:Q21,MATCH(U18,G13:G21,0),MATCH(U10,I10:Q10)),IF(U18=\"Foreign Nat' With Fico\",IF(U18=\"Foreign Nat' With Fico\",INDEX(G27:I67,(MATCH(U18,G27:G67,0)),3)),NA())))))))))))","v":{"$error":"#N/A"}},null,null,null,null,"Asset Utlization W/ Bank Stmt"]
[7.25,100.75,100.75,100.75,{"$error":"#N/A"},null,"620-639",0,-1.75,-2,-2.5,-3,-4.25,-5.25,{"$error":"#N/A"},{"$error":"#N/A"},{"$error":"#N/A"},null,"DTI",null,"Choose a Selection",{"$f":"IF(U19=\"DTI ≥50% - All Doc Types\",IF((AND(IF(U19=\"DTI ≥50% - All Doc Types\",1,0),(IF(U16=\"Full Doc\",1,0)),(IF(U21=\"Purchase\",1,0)),(IF(U22=\"Primary\",1,0)),(IF(OR(U20='Feed(WS)'!G3:G5),1,0)),(IF(OR(U10='Feed(WS)'!B3:B9),1,0)),(IF(OR(U11='Feed(WS)'!A3:A9),1,0)),(IF(U12=\"A+\",1,0)))),IF(U19=\"Choose a Selection\",0,(IF(U19=\"DTI  ≤45% - All Doc Types\",0,IF(U19=\"No DTI Program\",0,INDEX(I$27:I$67,MATCH(U19,G$27:G$67,0)))))),NA()), IF((AND(IF(U19=\"DTI ≥50% - All Doc Types\",1,0),(IF(U21<>\"Purchase\",1,0)))),NA(),IF(U19=\"Choose a Selection\",0,(IF(U19=\"DTI ≤45% - All Doc Types\",0,IF(U19=\"No DTI Program\",0,INDEX(I$27:I$67,MATCH(U19,G$27:G$67,0))))))))","v":0},null,{"$f":"W42","v":0}]
[7.375,101,101,101,{"$error":"#N/A"},null,"600-619",0,-2.5,-2.75,-3.25,-3.75,-5.25,-6.25,{"$error":"#N/A"},{"$error":"#N/A"},{"$error":"#N/A"},null,"Loan Balance",null,"Choose a Selection",{"$f":"IF(U20=\"Choose a Selection\",0,((IF(U20=\"$5,000,001-$7,500,000\",\"Call Lock Desk\",IF(U20=\"$7,500,001-$10,000,000\",\"Call Lock Desk\",INDEX(I$27:I$67,MATCH(U20,G$27:G$67,0)))))))","v":0},"No Ratio 0.75 - 0.99 (Review Matrix for LTV Qualification) "]
[7.4989999999999997,101.25,101.25,101.25,98,null,"Foreign Nat' No Fico",0,{"$error":"#N/A"},{"$error":"#N/A"},{"$error":"#N/A"},{"$error":"#N/A"},{"$error":"#N/A"},{"$error":"#N/A"},{"$error":"#N/A"},{"$error":"#N/A"},{"$error":"#N/A"},null,"Purpose",null,"Choose a Selection",{"$f":"IF(AND(OR(U21='Feed(WS)'!J5:J9),U10=\"85.01-90\"),NA(),IF(ISERROR(IF(OR(U21=\"Purchase\",U21=\"Rate/Term Refi\"),0,INDEX(I$27:I$67,MATCH(U21,G$27:G$67,0)))),0,INDEX(I$27:I$67,MATCH(U21,G$27:G$67,0))))","v":0},null,null,null,null,"DSCR/No Ratio Column Includes"]
[7.625,101.5,101.5,101.5,98.25,null,null,null,null,null,null,null,null,null,null,null,null,null,"Occupancy",null,"Choose a Selection",{"$f":"IF(OR('Feed(WS)'!A69:A75=TRUE),IF(U22=\"Choose a Selection\",0,(IF(OR(U22=\"Primary\"),0,IF(OR(U22=\"Non-Owner (Alt Doc/DSCR)\",U22=\"Full Doc - Non-Owner\"),0,INDEX(I$27:I$67,MATCH(U22,G$27:G$67,0)))))),NA())","v":{"$error":"#N/A"}},null,null,null,null,"DSCR"]
[7.75,101.75,101.75,101.75,98.5,null,null,null,null,null,null,null,null,null,null,null,null,null,"Property Type",null,"Choose a Selection",{"$f":"IF(AND(OR(U10='Feed(WS)'!B9:B11),OR(U23='Feed(WS)'!K9)),NA(),IF(U23=\"Choose a Selection\",0,(IF(OR(U23=\"SFR\",U23=\"1-2 Units\",U23=\"PUD\",U23=\"Condo\",U23=\"FL Condo\"),0,INDEX(I$27:I$67,MATCH(U23,G$27:G$67,0))))))","v":0},null,null,null,null,"No Ratio"]
[7.875,102,102,102,98.75,null,null,null,null,null,null,null,null,null,null,null,null,null,"Loan Term",null,"30YR Fixed",{"$f":"IF(AND(U10='Feed(WS)'!B11,OR(U24='Feed(WS)'!M5:M6,U24='Feed(WS)'!M9,U24='Feed(WS)'!M12)),NA(),INDEX(Q26:Q36,MATCH(U24,O26:O36,0)))","v":0}]
[7.9989999999999997,102.5,102.5,102.5,99.25,null,"Loan Level Price Adjustments",null,null,null,"Program",null,null,null,"Loan Term",null,null,null,"Escrow",null,"Escrow Not Waived",{"$f":"IF(U25=\"Escrow Not Waived\",0,INDEX(I$27:I$67,MATCH(U25,G$27:G$67,0)))","v":0}]
[8.125,102.75,102.75,102.75,99.5,null,null,null,"LLPA",null,"SELECT",null,0.5,null,"15YR Fixed",null,0.25,null,"Prepayment Penalty",null,"No PPP *See PPP Section*",{"$f":"IF(OR(U22=\"Primary\",U22=\"Second Home\"),0,INDEX(I$27:I$67,MATCH(U26,G$27:G$67,0)))","v":{"$error":"#N/A"}}]
[8.25,103,103,103,99.75,null,"DTI >45% - All Doc Types",null,0,null,"Core",null,0,null,"30YR Fixed",null,0,null,"NJ - Title Vesting",null,null,0]
[8.375,103.25,103.25,103.25,100,null,"DTI ≥50% - All Doc Types",null,-0.5,null,"SELECT - DSCR",null,0.5,null,"30YR IO Fixed",null,-0.5,null,"State",null,"Choose a Selection",{"$f":"IF(U16='Feed(WS)'!D5,IFERROR(INDEX(I71:I76,MATCH(U28,G71:G76,0)),0),0)","v":0},"PPP REQUIRED ON >80% LTVs"]
[8.4990000000000006,103.5,103.5,103.5,100.25,null,"ITIN",null,-1.5,null,"Core DSCR (≥1.20)",null,0,null,"40YR Fixed",null,-0.5,null,"Lock Term",null,"30 Day",{"$f":"INDEX(M55:M58,MATCH(U29,K55:K58,0))","v":0}]
[8.625,103.75,103.75,103.75,100.5,null,"VOE Only",null,-0.25,null,"Core DSCR (≥1.00)",null,0,null,"40YR IO Fixed",null,-0.75,null,"Buydown",null,"No",{"$f":"IF(OR(AND(OR(U30='Feed(WS)'!R4:R5),U21<>'Feed(WS)'!J3),AND(OR(U30='Feed(WS)'!R4:R5),U24<>'Feed(WS)'!M4)),NA(),0)","v":0},null,null,null,null,"*** Extension Cost"]
{"$rows_left_out":201}
{"sheet":"Feed(WS)","index":1,"n_rows":152,"n_cols":41,"rows_kept":152,"cut":false,"hidden":true,"merged":[[133,8,133,9],[79,8,79,11],[134,8,134,9],[128,1,128,3],[129,1,129,2],[130,1,130,2],[131,1,131,2],[132,1,132,2],[133,1,133,2],[79,1,79,4],[134,1,134,2],[137,1,137,2],[138,1,138,2],[139,1,139,2],[143,1,143,2],[135,1,135,2],[136,1,136,2],[140,1,140,2],[141,1,141,2],[142,1,142,2]]}
["FICO","LTV","Program","Doc Type","Additional Adjs","DTI","Loan Amount","Prepayment Penalties","Escrow Waiver","Purpose","Property Type","Occupancy","Term","Lock Period","Comp Type","Citizenships","Foreign National","Buydown","Subordinate Financing","State",null,"NOO & 2nd Home >75% LTV",null,{"$f":"IF(AND(OR('NonQM Program(LS)'!U10=B9:B11),OR('NonQM Program(LS)'!U22=L4:L6)),V4,V3)","v":"Not Applicable"},"All NonQM 25 except SELECT",{"$f":"IF(AND(\n   ISNUMBER(MATCH('NonQM Program(LS)'!$U$12, C3:C8, 0)),\n   ISNUMBER(MATCH('NonQM Program(LS)'!$U$16, D3:D5, 0)),\n   OR(\n     ISNUMBER(MATCH('NonQM Program(LS)'!$U$23, K3:K5, 0)),\n     ISNUMBER(MATCH('NonQM Program(LS)'!$U$23, K7:K10, 0))\n   )\n), 0.25, 0)","v":0},"Special "]
["Choose a Selection","Choose a Selection","Choose a Selection","Choose a Selection","Choose a Selection","Choose a Selection","Choose a Selection","Choose a Selection","Choose a Selection","Choose a Selection","Choose a Selection","Choose a Selection","Choose a Selection","Choose a Selection","Choose a Selection","Choose a Selection","Choose a Selection","Choose a Selection","Choose a Selection","Choose a Selection",null,"Full/Alt NOO & 2nd Home ≤75% LTV",null,{"$f":"IF(AND(OR('NonQM Program(LS)'!U10=B3:B8),OR('NonQM Program(LS)'!U12=C3:C4),OR('NonQM Program(LS)'!U22=L4:L6)),V4,V3)","v":"Not Applicable"}]
["780+","<=50","SELECT","Full Doc","None in this Dropdown","DTI ≤45% - All Doc Types","<$150,000","No PPP-States not allowed","Escrow Not Waived","Purchase","SFR","Primary","15YR Fixed","15 Day","Borrower Paid","US Citizen","Not Applicable1","No","No","All Other States",null,"Not Applicable",null,null,"Cash-Out/Debt Consol. FICO < 680",{"$f":"IF(AND(OR('NonQM Program(LS)'!U11=A9:A12),OR('NonQM Program(LS)'!U21=J5:J8)),VLOOKUP($Y$3,'NonQM Program(LS)'!$G$26:$I$66,3,FALSE),0)","v":0},"Cash-Out/Debt Consol. FICO < 680"]
["760-779","50.01-55","Core","Alt Doc","Asset Utilization","DTI >45% - All Doc Types","$150,000-$1,000,000","No PPP-States that allow","Escrow Waived","Refinances","2 Units","Second Home","30YR Fixed","30 Day",null,"Permanent Resident","Not Applicable2","2:1 Buydown","Yes","Alaska",null,"Yes",null,null,"Not Applicable",null," "]
["740-759","55.01-60","SELECT - DSCR","DSCR","1099 Only","DTI ≥50% - All Doc Types",">$1,000,000","12 Months PPP",null,"Debt Consol. ≤ 70% LTV","3-4 Units","Full Doc - Non-Owner","30YR IO Fixed","45 Day",null,"Non Perm Resident","Not Applicable3","1:0 Buydown",null,"California",null,null,null,null,"Yes",null,null,null," "]
["720-739","60.01-65","Core DSCR (≥1.20)",null,"VOE Only","No DTI Program",">$1,500,000","24 Months PPP",null,"Debt Consol. >70% LTV","DSCR 5-8 Units","Non-Owner (Alt Doc/DSCR)","40YR IO Fixed","60 Day",null,"ITIN",null,null,null,"Maryland",null,null,null,null,null,null,null,null," "]
["700-719","65.01-70","Core DSCR (≥1.00)",null,"P&L w/ Bk Stmt",null,">$2,000,000","36 Months PPP",null,"Cash-Out ≤ 70% LTV","Condo",null,"40YR Fixed","75 Day",null,"Foreign Nat' With Fico",null,null,null,"Minnesota",null,null,null,"green is logic",null,null,null,null," "]
["680-699","70.01-75","Sub1 DSCR (0.75-0.99)",null,"P&L Only",null,">$2,500,000","48 Months PPP",null,"Cash-Out >70% LTV","FL Condo",null,"5/6 30YR ARM",null,null,null,null,null,null,"New Mexico",null,null,null,"z1 cell has 2 specials formulas",null,null,null,null," "]
["660-679","75.01-80","No Ratio DSCR - < 0.75  ",null,"DSCR STR",null,">$3,000,000","60 Months PPP",null,null,"NW Condo",null,"5/6 30YR IO ARM",null,null,null,null,null,null,"New Hampshire",null,null,null,null,null,null,null,null," "]
["640-659","80.01-85",null,null,null,null,">$3,500,000",null,null,null,"PUD",null,"5/6 40YR ARM",null,null,null,null,null,null,"Delaware",null,null,null,null,null,null,null,null," "]
["620-639","85.01-90",null,null,null,null,">$4,000,000",null,null,null,null,null,"7/6 30YR ARM",null,null,null,null,null,null,"Georgia"]
["600-619",null,null,null,null,null,null,null,null,null,null,null,"7/6 30YR IO ARM",null,null,null,null,null,null,"Illinois",null,null,null,null,null,null,null,null," "]
[null,null,"Reserves","Payment History","Credit Events",null,null,"Title Vesting",null,null,null,null,"7/6 40YR ARM",null,null,null,null,null,null,"Kansas",null,null,null,null,null,null,null,null," "]
[null,null,"Choose a Selection","Choose a Selection","Choose a Selection",null,null,null,null,null,null,null,null,null,null,null,null,null,null,"New Jersey"]
[null,null,"< 3 Months","0x30x12","12 Months",null,null,"NJ Title Vested In LLC",null,null,null,null,null,null,null,null,null,null,null,"Baltimore City, MD / Essex County, NJ"]
[" 'NanQ ONE Program'!",null,"≥ 3 Months","1x30x12","24 Months",null,null,"NJ Title Vested In Corp",null,null,null,null,null,null,null,null,null,null,null,"North Carolina"]
["Feed(WS)'!",null,"≥ 6 Months","1x30x12 (DSCR)","36 Months"]
[null,null,"≥ 12 Months","1x60x12","48 Months"]
[null,null,null,"1x30x6","NONE"]
[null,null,null,"0x30x24"]
[]
[null,null,null,null,null,null,null,null,null,null,null,null,null,null,null,null,null,null,null,null,null,null,null,null,null,null,null,null," "]
[null,null,null,null,null,null,null,null,null,null,null,null,null,null,null,null,null,null,null,null,null,null,null,null,null,null,null,null," "]
[null,null,null,null,null,null,null,null,null,null,null,null,null,null,null,null,null,null,null,null,null,null,null,null,null,null,null,null," "]
[null,null,null,null,null,null,null,null,null,null,null,null,null,null,null,null,null,null,null,null,null,null,null,null,null,null,null,null," "]
[null,null,null,null,null,null,null,null,null,null,null,null,null,null,null,null,null,null,null,null,null,null,null,null,null,null,null,null," "]
[null,null,null,null,null,null,null,null,null,null,null,null,null,null,null,null,null,null,null,null,null,null,null,null,null,null,null,null," "]
[null,null,null,null,null,null,null,null,null,null,null,null,null,null,null,null,null,null,null,null,null,null,null,null,null,null,null,null," "]
["Pop Ups",null,null,null,null,null,null,null,null,null,null,null,null,null,null,null,null,null,null,null,null,null,null,null,null,null,null,null," "]
["No Ratio above 60% warning",{"$f":"IF(AND(OR('NonQM Program(LS)'!U10='Feed(WS)'!B6:B11),'NonQM Program(LS)'!U12=\"No Ratio (0.75-0.99)\"),TRUE,FALSE)","v":false},null,null,null,null,null,null,null,null,null,null,null,null,null,null,null,null,null,null,null,null,null,null,null,null,null,null," "]
{"$rows_left_out":123}
{"sheet":"Cover Page","index":2,"n_rows":45,"n_cols":18,"rows_kept":45,"cut":false,"hidden":true,"merged":[[24,4,24,5],[26,6,26,8],[27,6,27,8],[25,4,25,5],[27,4,27,5],[25,6,25,8],[20,6,20,8],[20,2,20,3],[20,4,20,5],[36,17,36,19],[25,13,26,15],[27,13,28,15],[32,17,32,19],[30,17,30,19],[28,17,28,19],[26,17,26,19],[30,4,30,5],[21,6,21,8],[22,6,22,8],[23,6,23,8],[24,6,24,8],[28,6,28,8],[23,13,24,15],[11,1,11,21],[15,17,15,19],[24,17,24,19],[13,8,13,10],[14,8,16,10],[19,13,20,15],[17,13,18,15],[13,5,13,6],[18,17,18,20],[14,5,14,6],[20,17,20,19],[14,13,16,15],[19,2,19,9],[21,13,22,15],[24,2,24,3],[28,2,28,3],[28,4,28,5],[25,2,25,3],[27,2,27,3],[26,2,26,3],[26,4,26,5],[21,2,21,3],[21,4,21,5],[22,2,22,3],[22,4,22,5],[23,2,23,3],[23,4,23,5],[13,13,13,20],[13,2,13,4],[14,3,14,4],[15,2,15,4],[16,2,16,4],[15,5,15,6],[16,5,16,6],[44,1,44,21],[43,1,43,21],[36,2,36,3],[38,2,38,3],[36,5,36,6],[38,5,38,6],[36,8,36,9],[38,8,38,9],[38,17,38,19],[29,13,38,15],[29,2,29,3],[29,4,29,5],[30,6,30,8],[29,6,29,8],[30,2,30,3],[34,17,34,19]]}
[]
[]
[]
[]
[null,null,null,null,null,null,null,null,null,"19000 MacArthur Boulevard, 2nd Floor"]
[null,null,null,null,null,null,null,null,null,"Irvine, CA 92612"]
[]
[]
[]
[]
[]
[null,"LoanStream Mortgage Wholesale NANQ Rate Sheet"]
[]
[null,null,"Underwriting Fee",null,null,"Relock Fee",null,null,"Mortgagee Clause",null,null,null,null,"Contact list"]
[null,null,"NANQ",1295,null,-0.25,null,null,"OCMBC, INC. ISAOA \n19000 MacArthur Blvd, Ste. 200 Irvine, CA 92612",null,null,null,null,"Corporate \nHeadquarters:",null,null,"Phone:","800-760-1833"]
[null,null,"DOC Fee - All Loans",null,null,"Extension Fee",null,null,null,null,null,null,null,null,null,null,"Email:","Inquires@LSMortgage.com"]
[null,null,79,null,null,"0.02/Day"]
[null,null,null,null,null,null,null,null,null,null,null,null,null,"NAN-Q\n Prequals",null,null,"Phone:","Email Only"]
[null,null,null,null,null,null,null,null,null,null,null,null,null,null,null,null,"Email:","EZQual@LSMortgage.com"]
[null,null,"Current Turn Times",null,null,null,null,null,null,null,null,null,null,"U/W Loan \nScenarios NAN-Q",null,null,"Phone:","Email Only"]
[null,null,"Stage",null,"Turn Times",null,"Department Hours",null,null,"Cutoff Time",null,null,null,null,null,null,"Email:","NANQScenario@LSMortgage.com"]
[null,null,"PreQual",null,"24-48 Hours",null,"PreQual Desk Hours: 8:00 AM-5:00 PM PST",null,null,"3:00 PM PST",null,null,null,"Submission Desk",null,null,"Phone:","Email Only"]
[null,null,"Set-up",null,"24-48 Hours",null,"Setup Desk Hours: 8:00 AM-6:00 PM PST",null,null,null,null,null,null,null,null,null,"Email:","Submissions_LS@LSMortgage.com"]
[null,null,"New Underwrite",null,"24-48 Hours",null,"Underwriting Hours: 7:00 AM-6:00 PM PST",null,null,"3:00 PM PST",null,null,null,"Lock Desk:",null,null,"Phone:","949-679-7059"]
[null,null,"Conditions Review",null,"24-48 Hours",null,"Underwriting Hours: 7:00 AM-6:00 PM PST",null,null,"3:00 PM PST",null,null,null,null,null,null,"Email:","LockDesk@LSMortgage.com"]
[null,null,"Part \"A\" QC",null,"48-72 Hours",null,"PreQual Desk Hours: 8:00 AM-5:00 PM PST",null,null,"3:30 PM PST",null,null,null,"CD Desk:",null,null,"Phone:","Email Only"]
[null,null,"Lock Desk",null,"SameDay",null,"Lock Desk Hours are: 8:30 AM - 5:00 PM PST",null,null,"5:00 PM PST",null,null,null,null,null,null,"Email:","CD@LSMortgage.com"]
[null,null,"CTC Review",null,"SameDay",null,"Underwriting Hours: 7:00 AM-6:00 PM PST",null,null,"1:00 PM PST",null,null,null,"Funding Department:",null,null,"Phone:","Email Only"]
[null,null,"CD",null,"SameDay",null,"CD Desk Hours: 7:30 AM-6:00 PM PST",null,null,"12:00 PM PST",null,null,null,null,null,null,"Email:","Funding@LSMortgage.com"]
[null,null,"DOCS",null,"SameDay",null,"DOCS Desk Hours: 7:30 AM-6:00 PM PST",null,null,"12:00 PM PST",null,null,null,"Management \nEscalations",null,null,"Name:","David Racer / Operations"]
{"$rows_left_out":16}
{"sheet":"Sheet1","index":3,"n_rows":0,"n_cols":0,"rows_kept":0,"cut":false,"hidden":true,"merged":[]}