{"text_format":"1","workbook":"xlsx","n_sheets":4,"sheets":["NanQ ONE Program","Feed","Cover Page","Sheet1"],"not_rendered":{"charts":0,"images":4,"macros":1,"external_links":0,"defined_names":2,"comments":0,"pivot_tables":0},"unopened":[],"bounds":{"document_bytes":16777216,"sheet_cells":100000,"rows_first":2000,"rows_last":500,"rows_between":2000,"halvings":0,"cell_chars":16384,"cell_head_chars":4096},"cells_cut":0,"cells_raw":0,"read":"whole","date_system":"1900"}

{"sheet":"NanQ ONE Program","index":0,"n_rows":58,"n_cols":43,"rows_kept":58,"cut":false,"hidden":false,"merged":[[39,1,62,4],[44,18,62,25],[0,33,0,34],[41,6,41,7],[42,6,42,7],[45,6,45,7],[46,6,46,7],[47,6,47,7],[48,6,48,7],[26,6,26,7],[22,18,22,19],[24,18,24,19],[25,6,25,7],[22,14,22,15],[24,6,24,7],[40,18,40,20],[41,18,41,20],[52,14,52,16],[54,14,54,16],[53,14,53,16],[50,14,50,15],[28,18,28,20],[41,14,41,15],[40,14,40,15],[38,6,38,7],[39,6,39,7],[31,10,31,11],[32,10,32,11],[37,6,37,7],[33,14,33,16],[34,14,34,15],[39,10,42,12],[36,6,36,7],[43,6,43,7],[44,6,44,7],[50,6,50,7],[49,14,49,15],[43,14,43,15],[36,14,36,15],[5,1,6,16],[8,6,8,16],[8,1,8,4],[48,10,48,11],[46,14,46,16],[47,14,47,15],[48,14,48,15],[45,12,46,12],[44,14,44,15],[49,6,49,7],[42,14,42,15],[26,10,26,11],[27,6,27,7],[26,14,26,15],[39,14,39,15],[34,10,34,12],[28,14,28,15],[29,14,29,15],[21,14,21,15],[25,18,25,19],[25,10,25,11],[23,10,23,11],[22,6,22,7],[23,6,23,7],[30,22,30,25],[31,18,31,20],[23,14,23,15],[24,14,24,15],[22,10,22,11],[27,14,27,15],[30,26,40,28],[33,18,33,20],[35,18,35,20],[33,22,33,25],[16,22,16,25],[18,22,18,25],[27,22,27,25],[29,18,29,20],[19,22,19,25],[17,22,17,25],[22,26,22,28],[19,18,19,19],[28,26,28,28],[36,18,36,20],[31,22,31,25],[30,18,30,20],[26,18,26,19],[34,22,34,25],[36,22,36,25],[39,18,39,20],[37,18,37,20],[32,22,32,25],[23,18,23,19],[0,7,1,10],[28,22,28,25],[34,18,34,20],[27,10,27,11],[28,10,28,11],[0,14,1,16],[3,7,3,10],[4,14,4,16],[13,18,13,19],[14,18,14,19],[24,22,24,25],[2,7,2,10],[21,18,21,19],[8,18,8,19],[7,18,7,19],[2,14,2,16],[3,13,3,16],[5,18,6,25],[4,12,4,13],[21,6,21,7],[27,18,27,20],[31,14,31,15],[26,22,26,23],[26,24,26,25],[10,0,13,0],[12,6,12,7],[13,6,13,7],[14,6,14,7],[15,6,15,7],[16,6,16,7],[17,6,17,7],[18,6,18,7],[18,18,18,19],[10,18,10,19],[10,6,10,7],[11,6,11,7],[16,18,16,19],[12,18,12,19],[11,18,11,19],[15,18,15,19],[17,18,17,19],[15,26,15,28],[21,26,21,28],[21,22,21,25],[17,26,17,28],[20,26,20,28],[20,22,20,25],[16,26,16,28],[22,22,23,25],[25,22,25,25],[7,26,7,28],[8,26,8,28],[9,26,9,28],[10,26,10,28],[11,26,11,28],[14,26,14,28],[8,23,8,25],[12,22,12,25],[9,23,9,25],[14,22,14,25],[10,23,10,25],[13,22,13,25],[13,26,13,27],[7,21,7,24],[52,6,62,8],[57,10,62,16],[56,10,56,16],[47,11,47,12],[40,6,40,7],[41,21,41,24],[9,18,9,19],[9,6,9,7],[20,6,20,8],[20,14,20,16],[20,10,20,12],[21,10,21,11],[30,10,30,12],[37,14,37,15],[38,14,38,15],[37,10,37,11],[30,14,30,15],[32,18,32,20],[20,18,20,19],[35,14,35,15],[38,18,38,20],[25,14,25,15],[24,10,24,11],[37,22,37,25]]}
[null,null,null,null,null,null,null,"LoanStream Mortgage",null,null,null,null,null,null,"Wholesale Ratesheet",null,null,null,null,null,null,null,null,null,null,null,"V1.0",null,null,"Pop Ups",null,null,null,"Disqualifiers",null,null,null,null,null,null,null,"Occupancy"]
[null,null,null,null,null,null,null,null,null,null,null,null,null,null,null,null,null,null,null,null,null,null,null,null,null,null,null,null,null,"No Ratio above 60% warning",{"$f":"IF(AND(OR(U10=Feed!B5:B10),U12=\"No Ratio (0.75-0.99)\"),TRUE,FALSE)","v":false},null,null," Foreign National",{"$f":"IF(AND(U15=Feed!P7,OR(U11=Feed!A6:A10)),NA(),\"\")","v":""},"FN minimum 700 Fico rule",null,null,null,null,null,{"$f":"IF(AND(U18=Feed!J3,U19=Feed!L3,OR(U10=Feed!B9:B10),U12=Feed!C4),TRUE(),FALSE)","v":false},"80.01 - 90%/ A+/ Purch/ Primary"]
[null,null,null,null,null,null,null,"19000 MacArthur Blvd, Suite 200",null,null,null,null,null,null,"30 Day Lock Period",null,null,null,null,null,null,null,null,null,null,null,null,null,null,null,null,null,null,"ITIN",{"$f":"IF(AND(U15=Feed!P6,OR(U11=Feed!A6:A10)),NA(),\"\")","v":""},"ITIN minimum 700 Fico rule",null,null,null,null,null,{"$f":"IF(AND(U10=Feed!B9,U12=Feed!C5,OR(U11=Feed!A3:A4),U18=Feed!J3),TRUE,FALSE)","v":false},"80.01-85% / \"A\" Grade / 720 FICO / Purch"]
[null,null,null,null,null,null,null,"Irvine, CA 92612",null,null,null,null,null,"Borrower Paid Compensation",null,null,null,null,null,null,null,null,null,null,null,null,null,null,null,null,null,null,null," Foreign National",{"$f":"IF(AND(U15=Feed!P7,OR(U17=Feed!G7:G8)),NA(),\"\")","v":""},"FN 0-2 mil loan amount max",null,null,null,null,null,{"$f":"OR(U10=Feed!B3:B8)","v":false},"<80% LTV's"]
[null,null,null,null,null,null,null,null,null,null,null,null,"Effective Date:",null,"2022-08-29",null,null,null,null,null,null,null,null,null,null,null,null,null,null,null,null,null,null,"ITIN",{"$f":"IF(AND(U15=Feed!P6,OR(U17=Feed!G6:G8)),NA(),\"\")","v":""},"ITIN 0-1.5 mil loan amount max",null,null,null,null,null,{"$f":"IF(AND(U10=Feed!B9,U13=Feed!D5,U12=Feed!C9,U11=Feed!A3,U18=Feed!J3),TRUE,FALSE)","v":false},"80.01-85% / DSCR / >=1.00 Grade / Purch"]
[null,"NanQ \"ONE\" Program",null,null,null,null,null,null,null,null,null,null,null,null,null,null,null,null,"PriceOne Calculator",null,null,null,null,null,null,null,null,null,null,null,null,null,null,"Total",{"$f":"SUM(AI2:AI5)","v":0}]
[]
[null,null,null,null,null,null,null,null,null,null,null,null,null,null,null,null,null,null,null,null,"Inputs","Wholesale Ratesheet",null,null,null,null,"Full Doc Column Includes"]
[null,"Base Rate / Base Price",null,null,null,null,"FICO/LTV Price Adjustments",null,null,null,null,null,null,null,null,null,null,null," Interest Rate →",null,0,null,null,null,null,null,"Tax Returns"]
[null,"Rate","Full Doc","Alt Doc","DSCR",null,null,null,"<=50","50.01-60","60.01-65","65.01-70","70.01-75","75.01-80","80.01-85","85.01-90","90.01-95",null,"LTV Range",null,"Choose a Selection",null,null,null,null,null,"1099 Only"]
[null,6.125,99.5,99.5,{"$error":"#N/A"},null,"740+",null,0,-0.25,-0.5,-0.75,-1.25,-1.75,-4.75,-5.75,{"$error":"#N/A"},null,"FICO Range",null,"Choose a Selection",{"$f":"IF(U11=\"Choose Selection\",0,(IF((ISERROR((IF(U15=\"Foreign Nat' With Fico\",0,(INDEX(I11:Q19,MATCH(U11,G11:G19,0),MATCH(U10,I10:Q10)))))))=TRUE,NA(),(INDEX(I11:Q19,MATCH(U11,G11:G19,0),MATCH(U10,I10:Q10))))))","v":{"$error":"#N/A"}},null,null,null,null,"Asset Utilization Only"]
[null,6.25,100,100,{"$error":"#N/A"},null,"720-739",null,-0.25,-0.5,-0.75,-1.25,-1.75,-2.25,-5.25,-6.25,{"$error":"#N/A"},null,"Grade",null,"Choose a Selection",{"$f":"IF(U12=\"Choose a Selection\",0,(INDEX(M22:M29,MATCH(U12,K22:K29,0))))","v":0},null,null,null,null,"Asset Utilization W/ Full Doc"]
[null,6.375,100.5,100.5,{"$error":"#N/A"},null,"700-719",null,-0.5,-1,-1.5,-2,-2.5,-3,-5.75,-6.75,{"$error":"#N/A"},null,"Doc Type",null,"Choose a Selection"]
[null,6.5,100.75,100.75,99.75,null,"680-699",null,-0.75,-1.5,-2.25,-2.75,-3.25,-3.75,{"$error":"#N/A"},{"$error":"#N/A"},{"$error":"#N/A"},null,"Additional Adjs",null,"Choose a Selection",{"$f":"IF(AND(OR(U10=Feed!B9:B10),OR(U14=Feed!E4:E6)),NA(),IF((AND((IF(U10=\"85.01-90\",1,0))=1,(IF(U13=\"DSCR\",1,0))=1))=TRUE,NA(),(IF(OR((AND(OR(U11=Feed!$A$5:$A$10),IF(U10=\"80.01-85\",1,0),IF(U13=\"DSCR\",1,0)))=TRUE,(AND(OR(U11=Feed!A3:A10),IF(U10=\"80.01-85\",1,0),IF(U13=\"DSCR\",1,0),OR(U18=Feed!J4:J9))=TRUE)),NA(),IF(U14=\"Choose a Selection\",0,(IF(U14=\"None in this Dropdown\",0,IF(U14=\"12 Month Full / Alt Doc\",0,INDEX(I$23:I$51,MATCH(U14,G$23:G$51,0))))))))))","v":0}]
[null,6.625,101,101,100.25,null,"660-679",null,-1.25,-2,-2.75,-3.25,-3.75,-4.25,{"$error":"#N/A"},{"$error":"#N/A"},{"$error":"#N/A"},null,"Citizenships",null,"Choose a Selection",{"$f":"(IF(U15=\"US Citizen\",0,(IF(U15=\"Permanent Resident\",0,(IF(U15=\"Non Perm Resident\",0,(IF(U15=\"ITIN\",VLOOKUP(U15,G23:I51,3,0),(IF(U15=\"Foreign Nat' No Fico\",INDEX(I11:Q19,MATCH(U15,G11:G19,0),MATCH(U10,I10:Q10)),IF(U15=\"Foreign Nat' With Fico\",IF(U15=\"Foreign Nat' With Fico\",INDEX(G23:I51,(MATCH(U15,G23:G51,0)),3)),NA())))))))))))","v":{"$error":"#N/A"}},null,null,null,null,"Alt Doc Column Includes"]
[null,6.75,101.25,101.25,100.75,null,"640-659",null,-2,-2.75,-3.5,-4,-4.75,-5.5,{"$error":"#N/A"},{"$error":"#N/A"},{"$error":"#N/A"},null,"DTI",null,"Choose a Selection",{"$f":"IF(U16=\"DTI ≥50% - All Doc Types\",IF((AND(IF(U16=\"DTI ≥50% - All Doc Types\",1,0),(IF(U18=\"Purchase\",1,0)),(IF(U19=\"Primary\",1,0)),(IF(OR(U10=Feed!B3:B8),1,0)),(IF(OR(U11=Feed!A3:A7),1,0)),(IF(U12=\"A+\",1,0)))),IF(U16=\"Choose a Selection\",0,(IF(U16=\"DTI <50% - All Doc Types\",0,IF(U16=\"No DTI Program\",0,INDEX(I$23:I$51,MATCH(U16,G$23:G$51,0)))))),NA()), IF((AND(IF(U16=\"DTI ≥50% - All Doc Types\",1,0),(IF(U18<>\"Purchase\",1,0)))),NA(),IF(U16=\"Choose a Selection\",0,(IF(U16=\"DTI <50% - All Doc Types\",0,IF(U16=\"No DTI Program\",0,INDEX(I$23:I$51,MATCH(U16,G$23:G$51,0))))))))","v":0},"Please reach out to the Lock Desk to Price Loans >5MM",{"$f":"W35","v":0},null,null,"12 Bank Statements"]
[null,6.875,101.5,101.5,101,null,"620-639",null,-2.5,-3.25,-4,-4.75,-5.5,-6.25,{"$error":"#N/A"},{"$error":"#N/A"},{"$error":"#N/A"},null,"Loan Balance",null,"Choose a Selection",{"$f":"IF(U17=\"Choose a Selection\",0,((IF(U17=\"$5,000,001-$7,500,000\",\"Call Lock Desk\",IF(U17=\"$7,500,001-$10,000,000\",\"Call Lock Desk\",INDEX(I$23:I$51,MATCH(U17,G$23:G$51,0)))))))","v":0},"No Ratio 0.75 - 0.99 (Review Matrix for LTV Qualification) ",null,null,null,"12 or 24 CPA P&L"]
[null,7,101.75,101.75,101.25,null,"600-619",null,-3,-3.75,-4.5,-5.25,-6.25,-7.25,{"$error":"#N/A"},{"$error":"#N/A"},{"$error":"#N/A"},null,"Purpose",null,"Choose a Selection",{"$f":"IF(AND(OR(U18=Feed!J5:J9),U10=\"85.01-90\"),NA(),IF(ISERROR(IF(OR(U18=\"Purchase\",U18=\"Rate/Term Refi\"),0,INDEX(I$23:I$51,MATCH(U18,G$23:G$51,0)))),0,INDEX(I$23:I$51,MATCH(U18,G$23:G$51,0))))","v":0},"Cashout must be for business purpose only",null,null,null,"Asset Utlization W/ Bank Stmt"]
[null,7.125,102,102,101.5,null,"Foreign Nat' No Fico",null,{"$error":"#N/A"},{"$error":"#N/A"},{"$error":"#N/A"},{"$error":"#N/A"},{"$error":"#N/A"},{"$error":"#N/A"},{"$error":"#N/A"},{"$error":"#N/A"},{"$error":"#N/A"},null,"Occupancy",null,"Choose a Selection",{"$f":"IF(OR(AP2:AP5=TRUE),IF(U19=\"Choose a Selection\",0,(IF(OR(U19=\"Primary\"),0,IF(OR(U19=\"Non-Owner (Alt Doc/DSCR)\"),0,INDEX(I$23:I$51,MATCH(U19,G$23:G$51,0)))))),NA())","v":{"$error":"#N/A"}},null,null,null,null,{"$f":"IF(OR(U10=Feed!B3:B8),IF(U19=\"Choose a Selection\",0,(IF(OR(U19=\"Primary\"),0,IF(OR(U19=\"Non-Owner (Alt Doc/DSCR)\"),0,INDEX(I$23:I$51,MATCH(U19,G$23:G$51,0)))))),IF(AND(U18=Feed!J3,'NanQ ONE Program'!U19=Feed!L3,OR(U10=Feed!B9:B10)),IF(U19=\"Choose a Selection\",0,(IF(OR(U19=\"Primary\"),0,IF(OR(U19=\"Non-Owner (Alt Doc/DSCR)\"),0,INDEX(I$23:I$51,MATCH(U19,G$23:G$51,0)))))),NA()))","v":{"$error":"#N/A"}}]
[null,7.25,102.25,102.25,101.75,null,null,null,null,null,null,null,null,null,null,null,null,null,"Property Type",null,"Choose a Selection",{"$f":"IF(AND(OR(U10=Feed!B8:B10),OR(U20=Feed!K7)),NA(),IF(U17=\"Choose a Selection\",0,(IF(OR(U20=\"SFR\",U20=\"1-2 Units\",U20=\"PUD\",U20=\"Condo\"),0,INDEX(I$23:I$51,MATCH(U20,G$23:G$51,0))))))","v":0}]
[null,7.375,102.5,102.5,102,null,"Loan Level Price Adjustments",null,null,null,"Grades",null,null,null,"Loan Term",null,null,null,"Loan Term",null,"30YR Fixed",{"$f":"IF(AND(U10=Feed!B10,OR(U21=Feed!M5:M6,U21=Feed!M9,U21=Feed!M12)),NA(),INDEX(Q22:Q32,MATCH(U21,O22:O32,0)))","v":0},null,null,null,null,"DSCR/No Ratio Column Includes"]
[null,7.5,102.75,102.75,102.25,null,null,null,"LLPA",null,"Select - Standard",null,0.75,null,"15YR Fixed",null,0.25,null,"Escrow",null,"Escrow Not Waived",{"$f":"IF(U22=\"Escrow Not Waived\",0,INDEX(I$23:I$51,MATCH(U22,G$23:G$51,0)))","v":0},"Impounds Required On HPML Loans, Ask Your AM",null,null,null,"DSCR"]
[null,7.625,103,103,102.5,null,"DTI ≥50% - All Doc Types",null,-0.5,null,"A+",null,0.25,null,"30YR Fixed",null,0,null,"Prepayment Penalty",null,"No PPP *See PPP Section*",{"$f":"IF(OR(U19=\"Primary\",U19=\"Second Home\"),0,INDEX(I$23:I$51,MATCH(U23,G$23:G$51,0)))","v":-1.5},"Due to state statutes, LSM does not allow ARM loans in New Mexico",null,null,null,"No Ratio"]
[null,7.75,103.25,103.25,102.75,null,"Full Doc - Non-Owner",null,-0.5,null,"A",null,-1.25,null,"30YR IO Fixed",null,-0.5,null,"State",null,"All Other States",0]
[null,7.875,103.5,103.5,103,null,"ITIN",null,-1.5,null,"B",null,-2,null,"40YR Fixed",null,-0.5,null,"Lock Term",null,"30 Day",{"$f":"INDEX(M32:M33,MATCH(U25,K32:K33,0))","v":0}]
[null,8,103.75,103.75,103.25,null,"VOE Only",null,-0.75,null,"C",null,-2,null,"40YR IO Fixed",null,-0.75,null,"Purchase Special",null,"Choose a Selection",{"$f":"Feed!S2","v":0},"UW Fee Buyout Calculator"]
[null,8.125,104,104,103.5,null,"1099 Only",null,-0.75,null,"Select - DSCR",null,0.5,null,"5/6 30YR ARM",null,0,null,"Appraisal In?",null,"Choose a Selection",{"$f":"AI6","v":0},"Loan Amount →",null,0,null,null,null,null,"Loan Amount rule",{"$f":"IF(V17<5,0,1)","v":0}]
[null,8.25,104.25,104.25,103.75,null,"Asset Utilization",null,-0.75,null,"DSCR (≥1.00)",null,0,null,"5/6 30YR IO ARM",null,-0.5,null,"  Total LLPA",null,null,{"$f":"SUM(V11:V27)","v":{"$error":"#N/A"}},{"$f":"IFERROR(1995/Y27*100,\"Input a Loan Amount\")","v":"Input a Loan Amount"},null,null,null,null,null,null,"Impounds rule",{"$f":"IF(NOT(U22=\"Escrow Waived\"),0,1)","v":0}]
[null,8.375,104.5,104.5,104,null,"Debt Consol. >70% LTV",null,-0.75,null,"No Ratio (0.75-0.99)",null,-1.5,null,"5/6 40YR ARM",null,-0.5,null,"  Gross Rate Sheet Price (Prior to LLPAs)",null,null,{"$f":"INDEX(B11:E55,MATCH(U9,B11:B55,0),MATCH(U13,C10:E10,0)+1)","v":{"$error":"#N/A"}},null,null,null,null,"*** Extension Cost",null,null,"Texas rule",{"$f":"IF(NOT(U24=\"Texas\"),0,1)","v":0}]
[null,8.5,104.75,104.75,104.25,null,"Debt Consol. ≤ 70% LTV",null,-0.25,null,null,null,null,null,"7/6 30YR ARM",null,0,null,{"$f":"((IF(V34=\"Price Too Low\",\"Minimum Price Not Met\"&\" \"&\"SELECT A HIGHER RATE\",\"Min Price\")))","v":"Min Price"},null,null,{"$f":"IF(U9>0,#REF!,#REF!)","v":{"$error":"#REF!"}},null,null,null,null,null,null,null,"15 Day Rule",{"$f":"IF(U25=\"15 Day\",0,1)","v":1}]
{"$rows_left_out":29}
{"sheet":"Feed","index":1,"n_rows":181,"n_cols":32,"rows_kept":181,"cut":false,"hidden":true,"merged":[[46,2,46,7],[180,1,180,2],[179,1,179,2],[176,1,176,2],[60,7,60,8],[79,1,79,4],[79,8,79,11],[123,1,123,4],[127,8,127,11],[177,1,177,2],[58,9,58,11],[46,9,46,10],[48,9,48,10],[0,17,0,18],[63,13,63,15],[64,13,64,15],[65,13,65,15],[66,13,66,15],[58,13,58,16],[59,13,59,15],[60,13,60,15],[61,13,61,15],[62,13,62,15]]}
["FICO","LTV","Grades","Doc Type","Additional Adjs","DTI","Loan Amount","Prepayment Penalties","Escrow Waiver","Purpose","Property Type","Occupancy","Term","Lock Period","Comp Type","Citizenships","Foreign National","Specials",null,null,null,null,"Message"]
["Choose a Selection","Choose a Selection","Choose a Selection","Choose a Selection","Choose a Selection","Choose a Selection","Choose a Selection","Choose a Selection","Choose a Selection","Choose a Selection","Choose a Selection","Choose a Selection","Choose a Selection","Choose a Selection","Choose a Selection","Choose a Selection","Choose a Selection","Choose a Selection",{"$f":"IF('NanQ ONE Program'!U26=Feed!R4,Feed!S3,IF(AND(OR('NanQ ONE Program'!U10=B3:B8), OR('NanQ ONE Program'!U12=C4:C7,'NanQ ONE Program'!U12=C9,'NanQ ONE Program'!U12=C10),'NanQ ONE Program'!U18=J3,'NanQ ONE Program'!U26=R3),0.25,0))","v":0},null,"State","Availability","No Penalty","12 Months","24 Months","36 Months","48 Months","60 Months",null,"Compensation Type",null,"Inactive Terms"]
["740+","<=50","Select - Standard","Full Doc","None in this Dropdown","DTI <50% - All Doc Types","<$150,000","No PPP *See PPP Section*","Escrow Not Waived","Purchase","SFR","Primary","15YR Fixed","15 Day","Borrower Paid","US Citizen","Not Applicable1","Non-QM Purchase Special",0.25,null,"Choose a Selection","Y"," ","Choose a Selection"," "," "," "," "," ","Borrower Paid",null,"5/6 30YR ARM"]
["720-739","50.01-60","A+","Alt Doc","Asset Utilization","DTI ≥50% - All Doc Types","$150,000-$1,000,000","6 Months PPP","Escrow Waived","Refinances","1-2 Units","Second Home","30YR Fixed","30 Day",null,"Permanent Resident","Not Applicable2","DSCR Special",null,null,"Illinois","Y"," ","Loans Must Close in the name of a Corp or LLC to allow PPP otherwise Buyout the PPP","Loans Must Close in the name of a Corp or LLC","Loans Must Close in the name of a Corp or LLC","Loans Must Close in the name of a Corp or LLC","Loans Must Close in the name of a Corp or LLC"," ","Lender Paid",null,"5/6 30YR IO ARM"]
["700-719","60.01-65","A","DSCR","1099 Only","No DTI Program",">$1,000,000","12 Months PPP",null,"Debt Consol. ≤ 70% LTV","3-4 Units","Full Doc - Non-Owner","30YR IO Fixed","45 Day",null,"Non Perm Resident","Not Applicable3","None",null,null,"Maryland","Y"," ","PPP Not Allowed","PPP Not Allowed","PPP Not Allowed","PPP Not Allowed","PPP Not Allowed"," ",null,null,"5/6 40YR ARM"]
["680-699","65.01-70","B",null,"VOE Only",null,">$1,500,000","24 Months PPP",null,"Debt Consol. >70% LTV","Condo","Non-Owner (Alt Doc/DSCR)","40YR IO Fixed","60 Day",null,"ITIN",null,null,null,null,"Michigan","Y"," ","PPP Not Allowed","PPP Not Allowed","PPP Not Allowed","PPP Not Allowed","PPP Not Allowed"," ","Channel",null,"7/6 30YR ARM"]
["660-679","70.01-75","C",null,null,null,">$2,000,000","36 Months PPP",null,"Cash-Out ≤ 70% LTV","NW Condo",null,"40YR Fixed","75 Day",null,"Foreign Nat' With Fico",null,null,null,null,"Minnesota","Y"," ","PPP Not Allowed","PPP Not Allowed","PPP Not Allowed","PPP Not Allowed","PPP Not Allowed"," ","W",null,"7/6 30YR IO ARM"]
["640-659","75.01-80","Select - DSCR",null,null,null,">$3,000,000","48 Months PPP",null,"Cash-Out >70% LTV","PUD",null,"5/6 30YR ARM",null,null,null,null,null,null,null,"North Dakota","Y"," ","PPP Not Allowed","PPP Not Allowed","PPP Not Allowed","PPP Not Allowed","PPP Not Allowed"," ",null,null,"7/6 40YR ARM"]
["620-639","80.01-85","DSCR (≥1.00)",null,null,null,null,"60 Months PPP",null,"Cash-Out >70% LTV",null,null,"5/6 30YR IO ARM",null,null,null,null,null,null,null,"New Jersey","Y"," ","Loans Must Close in the name of a Corp or LLC to allow PPP otherwise Buyout the PPP","Loans Must Close in the name of a Corp or LLC","Loans Must Close in the name of a Corp or LLC","Loans Must Close in the name of a Corp or LLC","Loans Must Close in the name of a Corp or LLC"," ","Pricing Special"]
["600-619","85.01-90","No Ratio (0.75-0.99)",null,null,null,null,null,null,null,null,null,"5/6 40YR ARM",null,null,null,null,null,null,null,"New Mexico","Y"," ","PPP Not Allowed","PPP Not Allowed","PPP Not Allowed","PPP Not Allowed","PPP Not Allowed"," ","Eligible"]
[null,null,null,null,null,null,null,null,null,null,null,null,"7/6 30YR ARM",null,null,null,null,null,null,null,"Pennsylvania","Y"," ","PPP Not Allowed","PPP Not Allowed","PPP Not Allowed","PPP Not Allowed","PPP Not Allowed",null,"Not Eligible"]
[null,null,null,null,null,null,null,null,null,null,null,null,"7/6 30YR IO ARM",null,null,null,null,null,null,null,"Texas","Y",null,null,null,null,null,null," "]
[null,null,null,null,null,null,null,null,null,null,null,null,"7/6 40YR ARM",null,null,null,null,null,null,null,"All Other States","Y"," ","PPP Allowed on Investment properties, State rules applies","PPP Allowed on Investment properties, State rules applies","PPP Allowed on Investment properties, State rules applies","PPP Allowed on Investment properties, State rules applies","PPP Allowed on Investment properties, State rules applies"," "]
[null,null,null,null,null,null,">$4,000,000"]
["Foreign Nat' No Fico",null,null,null,"DSCR 80.01-85% LTV"]
[]
[]
[]
[]
[]
[]
[null,"Rules",null,null,null,null,null,null,null,null,null,null,null,null,null,"Foreign Nat' With Fico",null,null,null,null,null,null,null,null,null,null,null,null," "]
[null,null,null,null,"No Prepay",0,null,null,null,null,null,null,null,null,null,"Foreign Nat' No Fico  ",null,null,null,null,null,null,null,null,null,null,null,null," "]
[null,"Prepay Cond. Format",{"$f":"IF(OR('NanQ ONE Program'!U19=\"Primary\",'NanQ ONE Program'!U19=\"Second Home\"),1,0)","v":0},null,"6 Months PPP",1,null,null,null,null,null,null,null,null,null,"Foreign Nat' No Fico  ",null,null,null,null,null,null,null,null,null,null,null,null," "]
[null,null,{"$f":"IF('NanQ ONE Program'!V36>0,0,1)","v":1},null,"12 Months PPP",1,null,null,null,null,null,null,null,null,null,null,null,null,null,null,null,null,null,null,null,null,null,null," "]
[null,null,{"$f":"IF('NanQ ONE Program'!V42:V42=\"Borrower Paid\",0,1)","v":1},null,"24 Months PPP",1,null,null,null,null,null,null,null,null,null,null,null,null,null,null,null,null,null,null,null,null,null,null," "]
[null,"State Format",{"$f":"IF(OR('NanQ ONE Program'!U19=\"Non-Owner (N/A DSCR)\",'NanQ ONE Program'!U19=\"Non-Owner (DSCR/No Ratio)\"),1,0)","v":0},null,"36 Months PPP",1,null,null,"NonQM Program'",null,null,null,null,null,null,null,null,null,null,null,null,null,null,null,null,null,null,null," "]
[null,null,null,null,null,null,null,null,null,null,null,null,null,null,null,null,null,null,null,null,null,null,null,null,null,null,null,null," "]
[null,null,null,null,null,null,null,null,null,null,null,null,null,null,null,null,null,null,null,null,null,null,null,null,null,null,null,null," "]
[null,null,null,null,"Primary",0,null,null,null,null,null,null,null,null,null,null,null,null,null,null,null,null,null,null,null,null,null,null," "]
{"$rows_left_out":152}
{"sheet":"Cover Page","index":2,"n_rows":45,"n_cols":18,"rows_kept":45,"cut":false,"hidden":true,"merged":[[24,4,24,5],[26,6,26,8],[27,6,27,8],[25,4,25,5],[27,4,27,5],[25,6,25,8],[20,6,20,8],[20,2,20,3],[20,4,20,5],[36,17,36,19],[25,13,26,15],[27,13,28,15],[32,17,32,19],[30,17,30,19],[28,17,28,19],[26,17,26,19],[30,4,30,5],[21,6,21,8],[22,6,22,8],[23,6,23,8],[24,6,24,8],[28,6,28,8],[23,13,24,15],[11,1,11,21],[15,17,15,19],[24,17,24,19],[13,8,13,10],[14,8,16,10],[19,13,20,15],[17,13,18,15],[13,5,13,6],[18,17,18,20],[14,5,14,6],[20,17,20,19],[14,13,16,15],[19,2,19,9],[21,13,22,15],[24,2,24,3],[28,2,28,3],[28,4,28,5],[25,2,25,3],[27,2,27,3],[26,2,26,3],[26,4,26,5],[21,2,21,3],[21,4,21,5],[22,2,22,3],[22,4,22,5],[23,2,23,3],[23,4,23,5],[13,13,13,20],[13,2,13,4],[14,3,14,4],[15,2,15,4],[16,2,16,4],[15,5,15,6],[16,5,16,6],[44,1,44,21],[43,1,43,21],[36,2,36,3],[38,2,38,3],[36,5,36,6],[38,5,38,6],[36,8,36,9],[38,8,38,9],[38,17,38,19],[29,13,38,15],[29,2,29,3],[29,4,29,5],[30,6,30,8],[29,6,29,8],[30,2,30,3],[34,17,34,19]]}
[]
[]
[]
[]
[null,null,null,null,null,null,null,null,null,"19000 MacArthur Boulevard, 2nd Floor"]
[null,null,null,null,null,null,null,null,null,"Irvine, CA 92612"]
[]
[]
[]
[]
[]
[null,"LoanStream Mortgage Wholesale NANQ Rate Sheet"]
[]
[null,null,"Underwriting Fee",null,null,"Relock Fee",null,null,"Mortgagee Clause",null,null,null,null,"Contact list"]
[null,null,"NANQ",1295,null,-0.25,null,null,"OCMBC, INC. ISAOA \n19000 MacArthur Blvd, Ste. 200 Irvine, CA 92612",null,null,null,null,"Corporate \nHeadquarters:",null,null,"Phone:","800-760-1833"]
[null,null,"DOC Fee - All Loans",null,null,"Extension Fee",null,null,null,null,null,null,null,null,null,null,"Email:","Inquires@LSMortgage.com"]
[null,null,79,null,null,"0.02/Day"]
[null,null,null,null,null,null,null,null,null,null,null,null,null,"NAN-Q\n Prequals",null,null,"Phone:","Email Only"]
[null,null,null,null,null,null,null,null,null,null,null,null,null,null,null,null,"Email:","EZQual@LSMortgage.com"]
[null,null,"Current Turn Times",null,null,null,null,null,null,null,null,null,null,"U/W Loan \nScenarios NAN-Q",null,null,"Phone:","Email Only"]
[null,null,"Stage",null,"Turn Times",null,"Department Hours",null,null,"Cutoff Time",null,null,null,null,null,null,"Email:","NANQScenario@LSMortgage.com"]
[null,null,"PreQual",null,"24-48 Hours",null,"PreQual Desk Hours: 8:00 AM-5:00 PM PST",null,null,"3:00 PM PST",null,null,null,"Submission Desk",null,null,"Phone:","Email Only"]
[null,null,"Set-up",null,"24-48 Hours",null,"Setup Desk Hours: 8:00 AM-6:00 PM PST",null,null,null,null,null,null,null,null,null,"Email:","Submissions_LS@LSMortgage.com"]
[null,null,"New Underwrite",null,"24-48 Hours",null,"Underwriting Hours: 7:00 AM-6:00 PM PST",null,null,"3:00 PM PST",null,null,null,"Lock Desk:",null,null,"Phone:","949-679-7059"]
[null,null,"Conditions Review",null,"24-48 Hours",null,"Underwriting Hours: 7:00 AM-6:00 PM PST",null,null,"3:00 PM PST",null,null,null,null,null,null,"Email:","LockDesk@LSMortgage.com"]
[null,null,"Part \"A\" QC",null,"48-72 Hours",null,"PreQual Desk Hours: 8:00 AM-5:00 PM PST",null,null,"3:30 PM PST",null,null,null,"CD Desk:",null,null,"Phone:","Email Only"]
[null,null,"Lock Desk",null,"SameDay",null,"Lock Desk Hours are: 8:30 AM - 5:00 PM PST",null,null,"5:00 PM PST",null,null,null,null,null,null,"Email:","CD@LSMortgage.com"]
[null,null,"CTC Review",null,"SameDay",null,"Underwriting Hours: 7:00 AM-6:00 PM PST",null,null,"1:00 PM PST",null,null,null,"Funding Department:",null,null,"Phone:","Email Only"]
[null,null,"CD",null,"SameDay",null,"CD Desk Hours: 7:30 AM-6:00 PM PST",null,null,"12:00 PM PST",null,null,null,null,null,null,"Email:","Funding@LSMortgage.com"]
[null,null,"DOCS",null,"SameDay",null,"DOCS Desk Hours: 7:30 AM-6:00 PM PST",null,null,"12:00 PM PST",null,null,null,"Management \nEscalations",null,null,"Name:","David Racer / Operations"]
{"$rows_left_out":16}
{"sheet":"Sheet1","index":3,"n_rows":0,"n_cols":0,"rows_kept":0,"cut":false,"hidden":true,"merged":[]}