{"text_format":"1","workbook":"xlsx","n_sheets":9,"sheets":["Errors","NonQM","DSCR","Feed(WS)","Feed(DSCR)","Prepay Matrix (OLD)","NonQM (BC)","DSCR (BC)","Prepay Matrix"],"not_rendered":{"charts":0,"images":5,"macros":1,"external_links":0,"defined_names":1546,"comments":0,"pivot_tables":0},"unopened":[],"bounds":{"document_bytes":16777216,"sheet_cells":100000,"rows_first":2000,"rows_last":500,"rows_between":2000,"halvings":0,"cell_chars":16384,"cell_head_chars":4096},"cells_cut":0,"cells_raw":0,"read":"whole","date_system":"1900"}

{"sheet":"Errors","index":0,"n_rows":4,"n_cols":1,"rows_kept":4,"cut":false,"hidden":true,"merged":[]}
["Please list all the errors here"]
["Cell T11 on the DSCR rate sheet - just needs formatting"]
["need to remove the \"DSCR Cash-Out\". Should be handled under Loan Purpose"]
["Remove Lock Request buttons on all Calcs"]

{"sheet":"NonQM","index":1,"n_rows":232,"n_cols":22,"rows_kept":232,"cut":false,"hidden":false,"merged":[[2,2,2,3],[1,1,1,3],[50,1,50,3],[51,1,51,3],[52,1,53,3],[57,1,57,3],[58,1,69,3],[70,1,70,3],[71,1,71,3],[72,1,72,3],[73,1,78,3],[79,1,87,3],[81,5,81,6],[82,5,82,15],[81,21,82,21],[77,19,78,20],[77,18,78,18],[77,21,78,21],[79,18,80,18],[79,19,80,20],[79,21,80,21],[85,5,85,6],[79,5,79,6],[83,5,83,6],[84,5,84,6],[80,5,80,6],[86,5,86,6],[77,5,77,6],[78,5,78,6],[81,18,82,18],[81,19,82,20],[71,5,71,6],[74,18,74,19],[72,18,72,19],[73,18,73,19],[75,5,75,6],[76,5,76,15],[70,5,70,6],[74,5,74,6],[72,5,72,6],[73,5,73,6],[76,18,76,21],[72,20,72,21],[70,18,70,19],[69,20,69,21],[71,20,71,21],[71,18,71,19],[64,18,64,19],[70,20,70,21],[66,18,66,19],[69,18,69,19],[30,18,30,19],[31,18,31,19],[32,18,32,19],[33,18,33,19],[34,18,34,19],[36,18,36,20],[37,18,37,20],[38,18,38,20],[39,18,39,20],[40,18,40,21],[35,18,35,20],[46,18,46,19],[46,20,46,21],[53,18,53,21],[54,18,54,19],[47,18,49,21],[50,18,51,21],[41,18,41,21],[42,18,42,19],[42,20,42,21],[45,18,45,19],[5,5,6,15],[5,18,6,21],[8,5,8,15],[9,5,9,6],[13,5,13,6],[11,5,11,6],[11,18,11,19],[12,18,12,19],[12,5,12,6],[28,18,28,19],[29,18,29,19],[20,5,20,15],[24,5,24,15],[23,18,23,19],[13,18,13,19],[41,5,41,6],[42,5,42,6],[16,5,16,6],[22,18,22,19],[17,18,17,19],[32,5,32,6],[27,5,27,6],[28,5,28,6],[29,5,29,6],[33,5,33,6],[45,5,45,6],[38,5,38,6],[37,5,37,15],[34,5,34,6],[43,5,43,6],[44,5,44,6],[40,5,40,6],[0,13,0,15],[0,17,0,18],[1,13,1,15],[1,17,1,18],[2,13,2,15],[2,17,2,18],[21,5,21,15],[21,18,21,19],[22,5,22,6],[9,18,9,19],[10,5,10,6],[10,18,10,19],[18,5,18,6],[18,18,18,19],[19,5,19,6],[19,18,19,19],[4,12,4,13],[4,14,4,15],[20,18,20,19],[46,5,46,6],[47,5,47,6],[62,5,62,6],[63,5,63,6],[64,5,64,6],[65,5,65,6],[66,5,66,6],[69,5,69,6],[53,5,53,6],[48,5,48,6],[49,5,49,15],[54,5,54,6],[55,5,55,15],[67,5,67,6],[68,5,68,15],[61,5,61,6],[56,5,56,6],[57,5,57,6],[58,5,58,6],[59,5,59,6],[60,5,60,6],[50,5,50,6],[51,5,51,6],[52,5,52,6],[45,20,45,21],[5,1,6,3],[7,1,7,3],[8,1,8,3],[25,5,25,6],[26,5,26,6],[23,5,23,6],[16,18,16,19],[17,5,17,6],[24,18,24,19],[25,18,25,19],[26,18,26,19],[30,5,30,6],[36,5,36,6],[15,5,15,6],[14,5,14,6],[14,18,14,19],[15,18,15,19],[43,18,43,19],[44,18,44,19],[27,18,27,19],[39,5,39,6],[35,5,35,6],[31,5,31,15]]}
[null,null,null,null,null,null,null,null,null,null,null,null,null,"LoanStream Mortgage"]
[null,"March Special",null,null,null,null,null,null,null,null,null,null,null,"19000 MacArthur Blvd, Suite 200"]
[null,"25 Bps","NonQm & DSCR",null,null,null,null,null,null,null,null,null,null,"Irvine, CA 92612"]
[]
[null,null,null,null,null,null,null,null,null,null,null,null,"Effective Date:",null,"2026-03-25"]
[null,"Base Price",null,null,null,"NonQM LoanStream",null,null,null,null,null,null,null,null,null,null,null,null,"NonQM Price Calculator"]
[]
[]
[null,"30 Day Lock",null,null,null,"Loan Level Pricing Adjustments",null,null,null,null,null,null,null,null,null,null,null,null,null,null,"Inputs"]
[null,"Rate","Full Doc","Alt Doc",null,"FICO/LTV",null,"<=50","50.01-55","55.01-60","60.01-65","65.01-70","70.01-75","75.01-80","80.01-85","85.01-90",null,null," Interest Rate →",null,0]
{"$rows_left_out":223}
{"sheet":"DSCR","index":2,"n_rows":83,"n_cols":20,"rows_kept":83,"cut":false,"hidden":false,"merged":[[1,1,1,3],[2,2,2,3],[80,16,81,16],[80,17,81,18],[80,19,81,19],[82,16,83,16],[82,17,83,18],[82,19,83,19],[44,16,44,17],[45,16,45,17],[45,18,45,19],[46,16,46,17],[46,18,46,19],[50,16,51,19],[77,16,77,19],[78,16,79,16],[78,17,79,18],[78,19,79,19],[12,5,12,6],[12,16,12,17],[5,1,6,3],[8,1,8,3],[16,5,16,6],[16,16,16,17],[0,11,0,14],[1,11,1,14],[2,11,2,14],[3,13,3,14],[4,11,4,12],[4,13,4,14],[10,5,10,6],[10,16,10,17],[11,5,11,6],[11,16,11,17],[5,5,6,14],[5,16,6,19],[8,5,8,14],[9,5,9,6],[9,16,9,17],[17,5,17,6],[17,16,17,17],[18,5,18,6],[18,16,18,17],[13,5,13,6],[13,16,13,17],[14,5,14,6],[14,16,14,17],[15,5,15,6],[15,16,15,17],[21,20,22,20],[22,5,22,6],[23,5,23,6],[23,16,23,17],[23,20,24,20],[24,5,24,6],[24,16,24,17],[19,5,19,6],[19,16,19,17],[20,5,20,14],[20,16,20,17],[21,5,21,14],[22,16,22,17],[21,16,21,17],[25,5,25,6],[25,16,25,17],[25,20,26,20],[26,5,26,6],[26,16,26,17],[27,5,27,6],[27,16,27,17],[27,20,28,20],[28,5,28,14],[28,16,28,17],[37,20,38,20],[38,5,38,6],[38,16,38,18],[39,5,39,6],[39,16,39,18],[29,5,29,6],[29,16,29,17],[29,20,30,20],[30,5,30,6],[30,16,30,17],[31,5,31,6],[31,16,31,17],[31,20,32,20],[32,5,32,6],[32,16,32,17],[33,5,33,6],[33,20,34,20],[34,5,34,14],[33,16,33,17],[35,5,35,6],[35,16,35,18],[35,20,36,20],[36,5,36,6],[36,16,36,18],[56,1,56,2],[56,5,56,6],[57,1,57,3],[57,5,57,6],[54,1,54,2],[54,5,54,6],[39,20,40,20],[40,5,40,6],[45,5,45,6],[45,20,46,20],[46,5,46,6],[47,5,47,6],[48,5,48,6],[41,5,41,6],[41,20,42,20],[42,5,42,6],[43,5,43,6],[43,20,44,20],[44,5,44,14],[47,16,49,19],[42,18,42,19],[43,16,43,17],[55,1,55,2],[86,1,86,2],[87,1,87,2],[75,1,75,3],[79,1,79,3],[69,1,69,3],[70,1,70,3],[71,1,74,3],[65,16,65,17],[65,5,65,6],[66,5,66,6],[67,16,67,17],[67,5,67,6],[68,1,68,3],[68,5,68,6],[58,1,67,3],[58,5,58,6],[59,5,59,6],[60,5,60,6],[61,5,61,6],[64,5,64,6],[77,5,77,6],[78,5,78,6],[75,5,75,14],[76,5,76,6],[34,16,34,17],[79,5,79,6],[51,5,51,6],[52,5,52,6],[53,5,53,6],[71,5,71,6],[72,5,72,6],[73,5,73,6],[74,5,74,6],[54,16,54,17],[37,5,37,6],[37,16,37,18],[49,5,49,14],[50,5,50,6],[62,5,62,14],[63,5,63,6],[69,5,69,14],[70,5,70,6],[40,16,40,19],[41,16,41,19],[42,16,42,17],[55,5,55,6]]}
[null,null,null,null,null,null,null,null,null,null,null,"LoanStream Mortgage"]
[null,"March Special",null,null,null,null,null,null,null,null,null,"19000 MacArthur Blvd, Suite 200"]
[null,"25 Bps","NonQm & DSCR",null,null,null,null,null,null,null,null,"Irvine, CA 92612"]
[]
[null,null,null,null,null,null,null,null,null,null,null,"Effective Date:",null,"2026-03-25"]
[null,"Base Price",null,null,null,"DSCR LoanStream",null,null,null,null,null,null,null,null,null,null,"NonQM Price Calculator"]
[]
[]
[null,"30 Day Lock",null,null,null,"Loan Level Pricing Adjustments",null,null,null,null,null,null,null,null,null,null,null,null,"Inputs"]
[null,"Rate","DSCR","DSCR 5-8",null,"FICO/LTV",null,"<=50","50.01-55","55.01-60","60.01-65","65.01-70","70.01-75","75.01-80","80.01-85",null," Interest Rate →",null,0]
{"$rows_left_out":74}
{"sheet":"Feed(WS)","index":3,"n_rows":218,"n_cols":41,"rows_kept":218,"cut":false,"hidden":true,"merged":[[161,1,161,11],[160,1,160,2],[133,8,133,9],[79,8,79,11],[134,8,134,9],[128,1,128,3],[129,1,129,2],[130,1,130,2],[131,1,131,2],[132,1,132,2],[133,1,133,2],[79,1,79,4],[134,1,134,2],[137,1,137,2],[138,1,138,2],[139,1,139,2],[143,1,143,2],[135,1,135,2],[136,1,136,2],[140,1,140,2],[141,1,141,2],[142,1,142,2]]}
["FICO","LTV","Program","Doc Type","Additional Adjs","DTI","Loan Amount","Prepayment Penalties","Escrow Waiver","Purpose","Property Type","Occupancy","Term","Lock Period","Comp Type","Citizenships","Foreign National","Buydown","Subordinate Financing","State",null,"NOO & 2nd Home >75% LTV",null,{"$f":"IF(AND(OR(NonQM!U11=B9:B11),OR(NonQM!U23=L4:L6)),V4,V3)","v":"Not Applicable"},"All NonQM 25 except SELECT",{"$f":"IF(AND(OR(NonQM!U17=D3:D4),OR(NonQM!U22=J3:J7)),0.25)","v":false},"Special "]
["Choose a Selection","Choose a Selection","Choose a Selection","Choose a Selection","Choose a Selection","Choose a Selection","Choose a Selection","Choose a Selection","Choose a Selection","Choose a Selection","Choose a Selection","Choose a Selection","Choose a Selection","Choose a Selection","Choose a Selection","Choose a Selection","Choose a Selection","Choose a Selection","Choose a Selection","Choose a Selection",null,"Full/Alt NOO & 2nd Home ≤75% LTV",null,{"$f":"IF(AND(OR(NonQM!U11=B3:B8),OR(NonQM!U13=C3:C4),OR(NonQM!U23=L4:L6)),V4,V3)","v":"Not Applicable"}]
["780+","<=50","SELECT","Full Doc","None in this Dropdown","DTI ≤45% - All Doc Types","<$150,000","No PPP-States not allowed","Escrow Not Waived","Purchase","SFR","Primary","15YR Fixed","15 Day","Borrower Paid","US Citizen","Not Applicable1","No","No","Alaska",null,"Not Applicable",null,null,"Cash-Out/Debt Consol. FICO < 680",{"$f":"IF(AND(OR(NonQM!U12=A9:A12),OR(NonQM!U22=J5:J7)),VLOOKUP($Y$3,NonQM!$G$26:$I$82,3,FALSE),0)","v":0},"Cash-Out/Debt Consol. FICO < 680"]
["760-779","50.01-55","Core","Alt Doc","Asset Utilization","DTI >45% - All Doc Types","$150,001-$250,000","No PPP-States that allow","Escrow Waived","Rate Term Refi","2 Units","2nd Home","30YR Fixed","30 Day",null,"Permanent Resident","Not Applicable2","2:1 Buydown","Yes","All Other States",null,"Yes",null,null,"Not Applicable",null," "]
["740-759","55.01-60","SELECT - DSCR","DSCR","1099 w/ Bank Statement","DTI ≥50% - All Doc Types","$250,001-$500,000","12 Months PPP*",null,"Rate Term Refi FICO < 680","3-4 Units","Full Doc - Non-Owner","30YR IO Fixed","45 Day",null,"Non Perm Resident","Not Applicable3","1:0 Buydown",null,"Baltimore City, MD",null,null,null,null,"Yes",null,null,null," "]
["720-739","60.01-65","Core DSCR (≥1.20)",null,"VOE w/ Bank Statement","No DTI Program","$500,001-$1,000,000","24 Months PPP*",null,"Cash Out Refi","Condo","Non-Owner (Alt Doc/DSCR)","40YR IO Fixed","60 Day",null,"ITIN",null,null,null,"California",null,null,null,null,null,null,null,null," "]
["700-719","65.01-70","Core DSCR (≥1.00)",null,"P&L w/ Bank Statement",null,">$1,000,000","36 Months PPP*",null,"Cash Out Refi FICO < 680","FL Condo",null,"40YR Fixed","75 Day",null,"Foreign National",null,null,null,"Delaware",null,null,null,"green is logic",null,"NonQM!$U$22, $J$3",null,null," "]
["680-699","70.01-75","Sub1 DSCR (0.75-0.99)",null,"P&L Only",null,">$1,500,000","48 Months PPP*",null,null,"NW Condo",null,"5/6 30YR ARM",null,null,null,null,null,null,"Georgia",null,null,null,"z1 cell has 2 specials formulas",null,"NonQM!$U$22, $J$3:$J$7",null,null," "]
["660-679","75.01-80","No Ratio DSCR - < 0.75  ",null,"Professional",null,">$2,000,000","60 Months PPP*",null,null,"PUD",null,"5/6 30YR IO ARM",null,null,null,null,null,null,"Illinois",null,null,null,null,null,null,null,null," "]
["640-659","80.01-85","DSCR Fusion (DSCR + Asset Util)",null,"Short Term Rental",null,">$2,500,000","12 Months PPP (5% Fixed)**",null,null,"High Rise Condo",null,"5/6 40YR ARM",null,null,null,null,null,null,"Kansas",null,null,null,null,null,null,null,null," "]
{"$rows_left_out":209}
{"sheet":"Feed(DSCR)","index":4,"n_rows":217,"n_cols":41,"rows_kept":217,"cut":false,"hidden":true,"merged":[[140,1,140,2],[135,1,135,2],[136,1,136,2],[137,1,137,2],[138,1,138,2],[139,1,139,2],[142,1,142,2],[143,1,143,2],[160,1,160,2],[161,1,161,11],[141,1,141,2],[79,1,79,4],[79,8,79,11],[128,1,128,3],[129,1,129,2],[130,1,130,2],[132,1,132,2],[133,1,133,2],[133,8,133,9],[134,1,134,2],[131,1,131,2],[134,8,134,9]]}
["FICO","LTV","Program","Doc Type","Additional Adjs","DTI","Loan Amount","Prepayment Penalties","Escrow Waiver","Purpose","Property Type","Occupancy","Term","Lock Period","Comp Type","Citizenships","Foreign National","Buydown","Subordinate Financing","State",null,"NOO & 2nd Home >75% LTV",null,{"$f":"IF(AND(OR(NonQM!U11=B9:B11),OR(NonQM!U23=L4:L6)),V4,V3)","v":"Not Applicable"},"All NonQM 25 except SELECT",{"$f":"IF(AND(OR(DSCR!S17=D3),OR(DSCR!S21=J3:J7),OR(DSCR!S24<>K10)),0.25)","v":false},"Special "]
["Choose a Selection","Choose a Selection","Choose a Selection","Choose a Selection","Choose a Selection","Choose a Selection","Choose a Selection","Choose a Selection","Choose a Selection","Choose a Selection","Choose a Selection","Choose a Selection","Choose a Selection","Choose a Selection","Choose a Selection","Choose a Selection","Choose a Selection","Choose a Selection","Choose a Selection","Choose a Selection",null,"Full/Alt NOO & 2nd Home ≤75% LTV",null,{"$f":"IF(AND(OR(NonQM!U11=B3:B8),OR(NonQM!U13=C3:C4),OR(NonQM!U23=L4:L6)),V4,V3)","v":"Not Applicable"}]
["780+","<=50","SELECT","DSCR","None in this Dropdown","DTI ≤45% - All Doc Types","<$150,000","No PPP-States not allowed","Escrow Not Waived","Purchase","SFR","Primary","15YR Fixed","15 Day","Borrower Paid","US Citizen","Not Applicable1","No","No","Alaska",null,"Not Applicable",null,null,"Cash-Out/Debt Consol. FICO < 680",{"$f":"IF(AND(OR(DSCR!S12=A9:A12),OR(DSCR!S21=J5:J7)),VLOOKUP($Y$3,DSCR!$F$30:$O$34,3,FALSE),0)","v":0},"Cash-Out/Debt Consol. FICO < 680"]
["760-779","50.01-55","Core",null,"Asset Utilization","DTI >45% - All Doc Types","$150,001-$250,000","No PPP-States that allow","Escrow Waived","Rate Term Refi","2 Units","2nd Home","30YR Fixed","30 Day",null,"Permanent Resident","Not Applicable2","2:1 Buydown","Yes","All Other States",null,"hbn",null,null,"Not Applicable"]
["740-759","55.01-60","SELECT - DSCR",null,"1099 w/ Bank Statement","DTI ≥50% - All Doc Types","$250,001-$1,000,000","12 Months PPP*",null,"Cash Out Refi","3-4 Units","Full Doc - Non-Owner","30YR IO Fixed","45 Day",null,"Non Perm Resident","Not Applicable3","1:0 Buydown",null,"Baltimore City, MD",null,null,null,null,"Yes",null,null,null," "]
["720-739","60.01-65","Core DSCR (≥1.20)",null,"VOE w/ Bank Statement","No DTI Program",">$1,000,000","24 Months PPP*",null,"Rate Term Refi FICO < 680","Condo","Non-Owner (Alt Doc/DSCR)","40YR IO Fixed","60 Day",null,"ITIN",null,null,null,"California",null,null,null,null,null,null,null,null," "]
["700-719","65.01-70","Core DSCR (≥1.00)",null,"P&L w/ Bank Statement",null,">$1,500,000","36 Months PPP*",null,"Cash Out Refi FICO < 680","FL Condo","Choose a Selection","40YR Fixed","75 Day",null,"Foreign National",null,null,null,"Delaware",null,null,null,"green is logic",null,null,null,null," "]
["680-699","70.01-75","Sub1 DSCR (0.75-0.99)",null,"P&L Only",null,">$2,000,000","48 Months PPP*",null,null,"NW Condo",null,"5/6 30YR ARM",null,null,null,null,null,null,"Georgia",null,null,null,"z1 cell has 2 specials formulas",null,null,null,null," "]
["660-679","75.01-80","No Ratio DSCR - < 0.75  ",null,"Short Term Rental",null,">$2,500,000","60 Months PPP*",null,null,"PUD",null,"5/6 30YR IO ARM",null,null,null,null,null,null,"Illinois",null,null,null,null,null,null,null,null," "]
["640-659","80.01-85","DSCR Fusion (DSCR + Asset Util)",null,null,null,">$3,000,000","12 Months PPP (5% Fixed)**",null,null,"DSCR 5-8",null,"5/6 40YR ARM",null,null,null,null,null,null,"Kansas",null,null,null,null,null,null,null,null," "]
{"$rows_left_out":208}
{"sheet":"Prepay Matrix (OLD)","index":5,"n_rows":35,"n_cols":8,"rows_kept":35,"cut":false,"hidden":true,"merged":[[14,5,14,6],[25,5,27,6],[28,5,28,6],[1,5,3,6],[8,5,9,6],[4,5,5,6],[6,5,7,6],[10,5,12,6],[15,5,19,6],[20,5,24,6],[1,11,1,12],[5,11,7,12],[8,11,8,12],[9,11,9,12],[5,7,7,8],[8,7,8,8],[9,7,9,8],[2,11,3,12],[4,11,4,12],[1,7,1,8],[2,7,3,8],[4,7,4,8],[25,0,25,3],[34,0,34,3],[21,0,21,3],[22,0,22,1],[22,2,22,3],[23,0,23,1],[23,2,23,3],[19,0,19,1],[19,2,19,3],[20,0,20,1],[20,2,20,3],[24,0,24,1],[24,2,24,3],[16,0,16,1],[16,2,16,3],[17,0,17,1],[17,2,17,3],[18,0,18,1],[18,2,18,3],[13,0,13,1],[13,2,13,3],[14,0,14,1],[14,2,14,3],[15,0,15,1],[15,2,15,3],[10,0,10,1],[10,2,10,3],[11,0,11,1],[11,2,11,3],[12,0,12,1],[12,2,12,3],[7,0,7,1],[7,2,7,3],[8,0,8,1],[8,2,8,3],[9,0,9,1],[9,2,9,3],[4,0,4,1],[4,2,4,3],[5,0,5,1],[5,2,5,3],[6,0,6,1],[6,2,6,3],[1,0,1,3],[2,0,2,1],[2,2,2,3],[3,0,3,1],[3,2,3,3]]}
[]
["Standard Prepayment Penalties Allowed",null,null,null,null,"NonQM LPC Scenarios\nBase Price - LLPAs - Adjustments for Max Price = Net Price \nNet Price - LPC = Final Price with LPC",null,"YSP (Yield Spread Premium)"]
["Arizona",null,"Missouri",null,null,null,null,"Extra money that a Lender CAN pay to the Mortgage Broker / Originator or Borrower"]
["Alabama",null,"Montana"]
["Arkansas",null,"Nebraska",null,null,"1. Scenario with Max Price of 102, LPC Comp of 2.750\nAfter LPC Max Price would be 99.250 (102.000 - 2.750)",null,"LPC (Lender Paid Compensation)"]
["California",null,"Nevada",null,null,null,null,"Broker Compensation Comp Plan that was selected when signing Broker Package IE: 2.750 No Min No Max, that’s paid by the Lender"]
["Colorado",null,"North Carolina",null,null,"2. Scenario with Max Price of 102, LPC Comp of 2.000\nAfter LPC Max Price would be 100.000 (102.000 - 2.000)"]
["Connecticut",null,"North Dakota"]
["District of Columbia",null,"Oklahoma",null,null,"3. Scenario with Max Price of 100.000, LPC Comp of 1.000 \nAfter LPC Max Price would be 99.000 (100.000 - 1.000)",null,"BPC (Borrower Paid Compensation)"]
["Florida",null,"Oregon",null,null,null,null,"Broker Compensation Paid directly by the Borrower"]
{"$rows_left_out":26}
{"sheet":"NonQM (BC)","index":6,"n_rows":233,"n_cols":22,"rows_kept":233,"cut":false,"hidden":true,"merged":[[4,12,4,13],[4,14,4,15],[5,1,6,2],[5,5,6,15],[5,18,6,21],[8,1,8,2],[8,5,8,15],[0,13,0,15],[0,17,0,18],[1,13,1,15],[1,17,1,18],[2,13,2,15],[2,17,2,18],[12,5,12,6],[12,18,12,19],[13,5,13,6],[13,18,13,19],[14,5,14,6],[14,18,14,19],[9,5,9,6],[9,18,9,19],[10,5,10,6],[10,18,10,19],[11,5,11,6],[11,18,11,19],[18,5,18,6],[18,18,18,19],[19,5,19,6],[19,18,19,19],[20,5,20,15],[20,18,20,19],[15,5,15,6],[15,18,15,19],[16,5,16,6],[16,18,16,19],[17,5,17,6],[17,18,17,19],[24,5,24,15],[24,18,24,19],[25,5,25,6],[25,18,25,19],[26,5,26,6],[26,18,26,19],[21,5,21,15],[21,18,21,19],[22,5,22,6],[22,18,22,19],[23,5,23,6],[23,18,23,19],[30,5,30,15],[30,18,30,19],[31,5,31,6],[31,18,31,19],[32,5,32,6],[32,18,32,19],[27,5,27,6],[27,18,27,19],[28,5,28,6],[28,18,28,19],[29,5,29,6],[29,18,29,19],[36,5,36,15],[36,18,36,20],[37,5,37,6],[37,18,37,20],[38,5,38,6],[38,18,38,20],[33,5,33,6],[33,18,33,19],[34,5,34,6],[34,18,34,19],[35,5,35,6],[35,18,35,20],[46,5,46,6],[46,18,49,21],[47,5,47,15],[48,5,48,6],[49,5,49,6],[50,5,50,6],[50,18,50,21],[39,5,39,6],[39,18,39,20],[40,5,40,6],[41,5,41,6],[42,5,42,6],[43,5,43,6],[44,5,44,6],[45,5,45,6],[40,18,40,21],[41,18,45,21],[54,5,54,6],[54,18,54,19],[55,5,55,6],[56,5,56,6],[57,1,57,2],[57,5,57,6],[51,5,51,6],[51,18,51,21],[52,5,52,6],[52,18,52,21],[53,5,53,15],[53,18,53,21],[65,5,65,6],[65,18,65,19],[66,5,66,15],[66,18,66,19],[67,5,67,6],[67,18,67,19],[58,1,69,2],[58,5,58,6],[59,5,59,6],[60,5,60,6],[60,18,60,19],[61,5,61,6],[62,5,62,6],[62,18,62,19],[63,5,63,6],[64,5,64,6],[71,1,71,2],[71,5,71,6],[71,18,71,19],[72,1,72,2],[72,5,72,6],[72,18,72,19],[68,5,68,6],[68,18,68,19],[69,5,69,6],[69,18,69,19],[70,1,70,2],[70,5,70,6],[70,18,70,19],[79,5,79,6],[80,5,80,15],[81,5,81,6],[82,5,82,6],[83,5,83,6],[84,5,84,6],[73,1,78,2],[73,5,73,6],[73,18,73,19],[74,5,74,15],[74,18,74,19],[75,5,75,6],[76,5,76,6],[77,5,77,6],[78,5,78,6]]}
[null,null,null,null,null,null,null,null,null,null,null,null,null,"Brokers Choice Mortgage"]
[null,null,null,null,null,null,null,null,null,null,null,null,null,"19000 MacArthur Blvd, Suite 200"]
[null,null,null,null,null,null,null,null,null,null,null,null,null,"Irvine, CA 92612"]
[]
[null,null,null,null,null,null,null,null,null,null,null,null,"Effective Date:",null,"2025-07-31"]
[null,"Base Price",null,null,null,"NonQM Brokers Choice",null,null,null,null,null,null,null,null,null,null,null,null,"NonQM Price Calculator"]
[]
[]
[null,"30 Day Lock",null,null,null,"Loan Level Pricing Adjustments",null,null,null,null,null,null,null,null,null,null,null,null,null,null,"Inputs"]
[null,"Rate","Price",null,null,"FICO/LTV",null,"<=50","50.01-55","55.01-60","60.01-65","65.01-70","70.01-75","75.01-80","80.01-85","85.01-90",null,null," Interest Rate →",null,"Choose a Selection"]
{"$rows_left_out":224}
{"sheet":"DSCR (BC)","index":7,"n_rows":81,"n_cols":20,"rows_kept":81,"cut":false,"hidden":true,"merged":[[17,5,17,6],[17,16,17,17],[18,5,18,6],[18,16,18,17],[25,5,25,6],[25,16,25,17],[31,5,31,6],[31,16,31,17],[37,5,37,6],[37,16,37,18],[0,11,0,14],[1,11,1,14],[2,11,2,14],[3,13,3,14],[4,11,4,12],[4,13,4,14],[10,5,10,6],[10,16,10,17],[11,5,11,6],[11,16,11,17],[5,1,6,3],[5,5,6,14],[5,16,6,19],[8,1,8,3],[8,5,8,14],[9,5,9,6],[9,16,9,17],[16,5,16,6],[16,16,16,17],[13,5,13,6],[13,16,13,17],[14,5,14,6],[14,16,14,17],[15,5,15,6],[15,16,15,17],[12,5,12,6],[12,16,12,17],[21,20,22,20],[22,5,22,6],[22,16,22,17],[23,5,23,6],[23,16,23,17],[23,20,24,20],[24,5,24,6],[24,16,24,17],[19,5,19,6],[19,16,19,17],[20,5,20,14],[20,16,20,17],[21,5,21,14],[21,16,21,17],[25,20,26,20],[26,5,26,6],[26,16,26,17],[27,5,27,6],[27,16,27,17],[27,20,28,20],[28,5,28,14],[28,16,28,17],[29,5,29,6],[29,16,29,17],[29,20,30,20],[30,5,30,6],[30,16,30,17],[31,20,32,20],[32,5,32,6],[33,5,33,6],[33,20,34,20],[34,5,34,14],[34,16,34,17],[35,5,35,6],[35,16,35,18],[35,20,36,20],[36,5,36,6],[36,16,36,18],[37,20,38,20],[38,5,38,6],[38,16,38,18],[39,5,39,6],[39,16,39,18],[39,20,40,20],[40,5,40,6],[45,5,45,6],[45,20,46,20],[46,5,46,6],[46,16,49,19],[47,5,47,6],[48,5,48,6],[49,5,49,6],[41,5,41,6],[41,20,42,20],[42,5,42,6],[43,5,43,6],[43,20,44,20],[44,5,44,14],[40,16,40,19],[41,16,45,19],[54,16,54,17],[55,1,55,2],[55,5,55,6],[56,1,56,2],[56,5,56,6],[57,1,57,3],[57,5,57,6],[50,5,50,14],[51,5,51,6],[52,5,52,6],[53,5,53,6],[54,1,54,2],[54,5,54,6],[64,16,64,17],[65,5,65,6],[66,5,66,6],[66,16,66,17],[67,5,67,6],[68,1,68,3],[68,5,68,6],[58,1,67,3],[58,5,58,6],[59,5,59,6],[60,5,60,6],[61,5,61,6],[62,5,62,6],[63,5,63,14],[64,5,64,6],[69,1,69,3],[69,5,69,6],[70,1,70,3],[70,5,70,14],[71,1,74,3],[71,5,71,6],[72,5,72,6],[73,5,73,6],[74,5,74,6],[80,5,80,6],[86,1,86,2],[87,1,87,2],[75,1,75,3],[75,5,75,6],[76,5,76,14],[77,5,77,6],[78,5,78,6],[79,1,79,3],[79,5,79,6]]}
[null,null,null,null,null,null,null,null,null,null,null,"LoanStream Mortgage"]
[null,null,null,null,null,null,null,null,null,null,null,"19000 MacArthur Blvd, Suite 200"]
[null,null,null,null,null,null,null,null,null,null,null,"Irvine, CA 92612"]
[]
[null,null,null,null,null,null,null,null,null,null,null,"Effective Date:",null,"2025-07-31"]
[null,"Base Price",null,null,null,"DSCR LoanStream",null,null,null,null,null,null,null,null,null,null,"NonQM Price Calculator"]
[]
[]
[null,"30 Day Lock",null,null,null,"Loan Level Pricing Adjustments",null,null,null,null,null,null,null,null,null,null,null,null,"Inputs"]
[null,"Rate","DSCR","DSCR 5-8",null,"FICO/LTV",null,"<=50","50.01-55","55.01-60","60.01-65","65.01-70","70.01-75","75.01-80","80.01-85",null," Interest Rate →",null,6.25]
{"$rows_left_out":72}
{"sheet":"Prepay Matrix","index":8,"n_rows":29,"n_cols":8,"rows_kept":29,"cut":false,"hidden":false,"merged":[[0,0,0,3],[17,0,17,3],[14,0,15,1],[13,0,13,3],[1,0,1,3],[1,5,3,6],[1,7,1,8],[1,11,1,12],[2,7,3,8],[2,11,3,12],[6,5,7,6],[8,5,9,6],[4,5,5,6],[4,7,4,8],[4,11,4,12],[5,7,7,8],[5,11,7,12],[10,5,12,6],[8,7,8,8],[8,11,8,12],[9,7,9,8],[9,11,9,12],[25,5,27,6],[28,5,28,6],[20,5,24,6],[14,5,14,6],[15,5,19,6]]}
["For 1st Lien Business Purpose Loans Only\nPrepay Penalty (PPP) Requirements\nPPP Required on NOO with > 80% LTV\nPPP Options\n6 months interest on 80% of the Principal Balance;\n5% Fixed PPP Option = 5% Penalty on Current Balance\nfor the duration of the PPP term                                                                                                                                                          "]
["STANDARD PREPAYMENT PENALTIES ALLOWED",null,null,null,null,"NonQM LPC Scenarios\nBase Price - LLPAs - Adjustments for Max Price = Net Price \nNet Price - LPC = Final Price with LPC",null,"YSP (Yield Spread Premium)"]
["Arizona (AZ)","Idaho (ID)","Montana (MT)","Texas (TX)",null,null,null,"Extra money that a Lender CAN pay to the Mortgage Broker / Originator or Borrower"]
["Alabama (AL)","Indiana (IN)","Nebraska (NE)","Utah (UT)"]
["Arkansas (AR)","Iowa (IA)","Nevada (NV)","Vermont (VT)",null,"1. Scenario with Max Price of 102, LPC Comp of 2.750\nAfter LPC Max Price would be 99.250 (102.000 - 2.750)",null,"LPC (Lender Paid Compensation)"]
["California (CA)","Kansas (KS)","North Carolina (NC)","Virginia (VA)",null,null,null,"Broker Compensation Comp Plan that was selected when signing Broker Package IE: 2.750 No Min No Max, that’s paid by the Lender"]
["Colorado (CO)","Kentucky (KY)","North Dakota (ND)","Washington (WA)",null,"2. Scenario with Max Price of 102, LPC Comp of 2.000\nAfter LPC Max Price would be 100.000 (102.000 - 2.000)"]
["Connecticut (CT)","Louisiana (LA)","Oklahoma (OK)","West Virginia (WV)"]
["District of Columbia (DC)","Maine (ME)","Oregon (OR)","Wisconsin (WI)",null,"3. Scenario with Max Price of 100.000, LPC Comp of 1.000 \nAfter LPC Max Price would be 99.000 (100.000 - 1.000)",null,"BPC (Borrower Paid Compensation)"]
["Florida (FL)","Massachusetts (MA)","South Carolina (SC)","Wyoming (WY)",null,null,null,"Broker Compensation Paid directly by the Borrower"]
{"$rows_left_out":19}